{"text_format":"1","workbook":"xlsx","n_sheets":10,"sheets":["Summary Table","MESYS - Pellematic Smart XS","MESYS - Pellematic Smart XS-Non","MESYS - Pellematic 20","MESYS - Pellematic 32","MESYS - Pellematic 56","Froling - PE 1 Pellet 20","Froling - PE 1 Pellet 35","Hargassner - ECO-HK 70(CH)","Hargassner - ECO-HK 70(P)"],"not_rendered":{"charts":0,"images":1,"macros":1,"external_links":0,"defined_names":0,"comments":0,"pivot_tables":0},"unopened":[],"bounds":{"document_bytes":16777216,"sheet_cells":100000,"rows_first":2000,"rows_last":500,"rows_between":2000,"halvings":0,"cell_chars":16384,"cell_head_chars":4096},"cells_cut":0,"cells_raw":0,"read":"whole","date_system":"1900"}

{"sheet":"Summary Table","index":0,"n_rows":10,"n_cols":14,"rows_kept":10,"cut":false,"hidden":false,"merged":[]}
[null,null,null,null,null,"Tab #","Manufacturer","Model","Type","Fuel","Test Method","Lab","Cetrifier","Final determination"]
[null,null,null,null,null,1,{"$f":"'MESYS - Pellematic Smart XS'!$B$2","v":"Maine Energy Systems"},{"$f":"'MESYS - Pellematic Smart XS'!$B$3","v":"Pellematic Smart XS"},{"$f":"'MESYS - Pellematic Smart XS'!$F$3","v":"Boiler"},{"$f":"'MESYS - Pellematic Smart XS'!$B$15","v":"Pellet"},{"$f":"'MESYS - Pellematic Smart XS'!$B$14","v":"ASTM 2618"},{"$f":"'MESYS - Pellematic Smart XS'!$B$16","v":"RISE"},{"$f":"'MESYS - Pellematic Smart XS'!$B$17","v":"RISE"},{"$f":"IF('MESYS - Pellematic Smart XS'!$B$8<>\"\",'MESYS - Pellematic Smart XS'!$B$8,\"\")","v":"No determination "}]
[null,null,null,null,null,2,{"$f":"'MESYS - Pellematic Smart XS-Non'!$B$2","v":"Maine Energy Systems"},{"$f":"'MESYS - Pellematic Smart XS-Non'!$B$3","v":"Pellematic Smart XS"},{"$f":"'MESYS - Pellematic Smart XS-Non'!$F$3","v":"Boiler"},{"$f":"'MESYS - Pellematic Smart XS-Non'!$B$15","v":"Pellet"},{"$f":"'MESYS - Pellematic Smart XS-Non'!$B$14","v":"ASTM 2618"},{"$f":"'MESYS - Pellematic Smart XS-Non'!$B$16","v":"RISE"},{"$f":"'MESYS - Pellematic Smart XS-Non'!$B$17","v":"RISE"},{"$f":"IF('MESYS - Pellematic Smart XS-Non'!$B$8<>\"\",'MESYS - Pellematic Smart XS-Non'!$B$8,\"\")","v":"No determination "}]
[null,null,null,null,null,3,{"$f":"'MESYS - Pellematic 20'!$B$2","v":"Maine Energy Systems"},{"$f":"'MESYS - Pellematic 20'!$B$3","v":"Pellematic 20"},{"$f":"'MESYS - Pellematic 20'!$F$3","v":"Boiler"},{"$f":"'MESYS - Pellematic 20'!$B$15","v":"Pellet"},{"$f":"'MESYS - Pellematic 20'!$B$14","v":"ASTM 2618"},{"$f":"'MESYS - Pellematic 20'!$B$16","v":"RISE"},{"$f":"'MESYS - Pellematic 20'!$B$17","v":"RISE"},{"$f":"IF('MESYS - Pellematic 20'!$B$8<>\"\",'MESYS - Pellematic 20'!$B$8,\"\")","v":"Approved List - Pending"}]
[null,null,null,null,null,4,{"$f":"'MESYS - Pellematic 32'!$B$2","v":"Maine Energy Systems"},{"$f":"'MESYS - Pellematic 32'!$B$3","v":"Pellematic 32"},{"$f":"'MESYS - Pellematic 32'!$F$3","v":"Boiler"},{"$f":"'MESYS - Pellematic 32'!$B$15","v":"Pellet"},{"$f":"'MESYS - Pellematic 32'!$B$14","v":"ASTM 2618"},{"$f":"'MESYS - Pellematic 32'!$B$16","v":"RISE"},{"$f":"'MESYS - Pellematic 32'!$B$17","v":"RISE"},{"$f":"IF('MESYS - Pellematic 32'!$B$8<>\"\",'MESYS - Pellematic 32'!$B$8,\"\")","v":"Approved List - Pending"}]
[null,null,null,null,null,5,{"$f":"'MESYS - Pellematic 56'!$B$2","v":"Maine Energy Systems"},{"$f":"'MESYS - Pellematic 56'!$B$3","v":"Pellematic 56"},{"$f":"'MESYS - Pellematic 56'!$F$3","v":"Boiler"},{"$f":"'MESYS - Pellematic 56'!$B$15","v":"Pellet"},{"$f":"'MESYS - Pellematic 56'!$B$14","v":"ASTM 2618"},{"$f":"'MESYS - Pellematic 56'!$B$16","v":"RISE"},{"$f":"'MESYS - Pellematic 56'!$B$17","v":"RISE"},{"$f":"IF('MESYS - Pellematic 56'!$B$8<>\"\",'MESYS - Pellematic 56'!$B$8,\"\")","v":"Disapproved "}]
[null,null,null,null,null,6,{"$f":"'Froling - PE 1 Pellet 20'!$B$2","v":"Froling"},{"$f":"'Froling - PE 1 Pellet 20'!$B$3","v":"PE 1 Pellet 20"},{"$f":"'Froling - PE 1 Pellet 20'!$F$3","v":"Boiler"},{"$f":"'Froling - PE 1 Pellet 20'!$B$15","v":"Pellet"},{"$f":"'Froling - PE 1 Pellet 20'!$B$14","v":"ASTM 2618"},{"$f":"'Froling - PE 1 Pellet 20'!$B$16","v":"RISE"},{"$f":"'Froling - PE 1 Pellet 20'!$B$17","v":"RISE"},{"$f":"IF('Froling - PE 1 Pellet 20'!$B$8<>\"\",'Froling - PE 1 Pellet 20'!$B$8,\"\")","v":"No determination "}]
[null,null,null,null,null,7,{"$f":"'Froling - PE 1 Pellet 35'!$B$2","v":"Froling"},{"$f":"'Froling - PE 1 Pellet 35'!$B$3","v":"PE 1 Pellet 35"},{"$f":"'Froling - PE 1 Pellet 35'!$F$3","v":"Boiler"},{"$f":"'Froling - PE 1 Pellet 35'!$B$15","v":"Pellet"},{"$f":"'Froling - PE 1 Pellet 35'!$B$14","v":"ASTM 2618"},{"$f":"'Froling - PE 1 Pellet 35'!$B$16","v":"RISE"},{"$f":"'Froling - PE 1 Pellet 35'!$B$17","v":"RISE"},{"$f":"IF('Froling - PE 1 Pellet 35'!$B$8<>\"\",'Froling - PE 1 Pellet 35'!$B$8,\"\")","v":"No determination "}]
[null,null,null,null,null,8,{"$f":"'Hargassner - ECO-HK 70(CH)'!$B$2","v":"Hargassner"},{"$f":"'Hargassner - ECO-HK 70(CH)'!$B$3","v":"ECO-HK 70"},{"$f":"'Hargassner - ECO-HK 70(CH)'!$F$3","v":"Boiler"},{"$f":"'Hargassner - ECO-HK 70(CH)'!$B$15","v":"Chip"},{"$f":"'Hargassner - ECO-HK 70(CH)'!$B$14","v":"EPA M28 WHH"},{"$f":"'Hargassner - ECO-HK 70(CH)'!$B$16","v":"Polytests Inc."},{"$f":"'Hargassner - ECO-HK 70(CH)'!$B$17","v":"Not reported"},{"$f":"IF('Hargassner - ECO-HK 70(CH)'!$B$8<>\"\",'Hargassner - ECO-HK 70(CH)'!$B$8,\"\")","v":"No determination "}]
[null,null,null,null,null,9,{"$f":"'Hargassner - ECO-HK 70(P)'!$B$2","v":"Hargassner"},{"$f":"'Hargassner - ECO-HK 70(P)'!$B$3","v":"ECO-HK 70"},{"$f":"'Hargassner - ECO-HK 70(P)'!$F$3","v":"Boiler"},{"$f":"'Hargassner - ECO-HK 70(P)'!$B$15","v":"Pellet"},{"$f":"'Hargassner - ECO-HK 70(P)'!$B$14","v":"EPA M28 WHH"},{"$f":"'Hargassner - ECO-HK 70(P)'!$B$16","v":"Polytests Inc."},{"$f":"'Hargassner - ECO-HK 70(P)'!$B$17","v":"Not reported"},{"$f":"IF('Hargassner - ECO-HK 70(P)'!$B$8<>\"\",'Hargassner - ECO-HK 70(P)'!$B$8,\"\")","v":"No determination "}]

{"sheet":"MESYS - Pellematic Smart XS","index":1,"n_rows":135,"n_cols":8,"rows_kept":135,"cut":false,"hidden":false,"merged":[[59,7,59,8],[3,1,3,2],[3,3,3,5],[3,7,3,8],[7,1,7,6],[13,1,13,6],[13,7,13,8],[14,1,14,6],[14,7,14,8],[15,1,15,6],[15,7,15,8],[11,1,11,2],[11,3,11,4],[11,5,11,6],[11,7,11,8],[12,1,12,6],[12,7,12,8],[19,1,19,2],[19,3,19,5],[19,7,19,8],[20,1,20,2],[20,3,20,5],[20,7,20,8],[16,1,16,6],[0,0,0,8],[1,1,1,6],[1,7,1,8],[2,1,2,3],[2,5,2,6],[2,7,2,8],[9,1,9,6],[9,7,9,8],[10,1,10,2],[10,3,10,4],[10,5,10,6],[10,7,10,8],[8,1,8,6],[8,7,8,8],[4,1,4,6],[4,7,4,8],[5,1,5,6],[5,7,5,8],[6,1,6,6],[16,7,16,8],[17,1,17,6],[17,7,17,8],[18,1,18,2],[18,3,18,5],[18,7,18,8],[23,1,23,6],[23,7,23,8],[25,1,25,6],[25,7,25,8],[26,1,26,6],[26,7,26,8],[21,1,21,6],[21,7,21,8],[22,1,22,6],[22,7,22,8],[24,1,24,6],[24,7,24,8],[30,1,30,6],[30,7,30,8],[31,1,31,6],[31,7,31,8],[32,1,32,6],[32,7,32,8],[27,1,27,6],[27,7,27,8],[28,1,28,6],[28,7,28,8],[29,1,29,6],[29,7,29,8],[36,1,36,6],[36,7,36,8],[37,1,37,6],[37,7,37,8],[38,1,38,6],[38,7,38,8],[33,1,33,6],[33,7,33,8],[34,1,34,6],[34,7,34,8],[35,1,35,6],[35,7,35,8],[41,0,41,8],[42,7,42,8],[43,7,43,8],[44,7,44,8],[45,7,45,8],[46,7,46,8],[39,1,39,6],[39,7,39,8],[40,1,40,6],[40,7,40,8],[53,0,53,8],[54,7,54,8],[55,7,55,8],[56,7,56,8],[57,7,57,8],[58,7,58,8],[47,7,47,8],[48,7,48,8],[49,7,49,8],[50,7,50,8],[51,7,51,8],[52,7,52,8],[66,7,66,8],[67,7,67,8],[68,7,68,8],[69,7,69,8],[70,7,70,8],[71,7,71,8],[60,7,60,8],[61,7,61,8],[62,7,62,8],[63,0,63,8],[64,7,64,8],[65,7,65,8],[78,7,78,8],[79,7,79,8],[80,0,80,8],[81,7,81,8],[82,7,82,8],[83,7,83,8],[72,7,72,8],[73,0,73,8],[74,7,74,8],[75,7,75,8],[76,7,76,8],[77,7,77,8],[91,7,91,8],[92,7,92,8],[93,7,93,8],[94,7,94,8],[95,7,95,8],[84,7,84,8],[85,7,85,8],[86,7,86,8],[88,0,88,8],[89,7,89,8],[90,7,90,8],[87,7,87,8],[103,1,103,6],[103,7,103,8],[104,1,104,6],[104,7,104,8],[105,1,105,6],[105,7,105,8],[98,7,98,8],[99,7,99,8],[100,1,100,6],[100,7,100,8],[102,1,102,6],[102,7,102,8],[101,1,101,6],[101,7,101,8],[109,1,109,6],[109,7,109,8],[110,1,110,6],[110,7,110,8],[111,1,111,6],[111,7,111,8],[106,1,106,6],[106,7,106,8],[107,1,107,6],[107,7,107,8],[108,1,108,6],[108,7,108,8],[115,1,115,6],[115,7,115,8],[116,1,116,6],[116,7,116,8],[117,1,117,6],[117,7,117,8],[112,1,112,6],[112,7,112,8],[113,1,113,6],[113,7,113,8],[114,1,114,6],[114,7,114,8],[121,1,121,6],[121,7,121,8],[122,1,122,6],[122,7,122,8],[123,1,123,6],[123,7,123,8],[118,1,118,6],[118,7,118,8],[119,1,119,6],[119,7,119,8],[120,1,120,6],[120,7,120,8],[127,1,127,6],[127,7,127,8],[128,1,128,6],[128,7,128,8],[129,1,129,6],[129,7,129,8],[124,1,124,6],[124,7,124,8],[125,1,125,6],[125,7,125,8],[126,1,126,6],[126,7,126,8],[133,1,133,2],[133,3,133,5],[133,7,133,8],[134,1,134,8],[130,1,130,6],[130,7,130,8],[131,1,131,6],[131,7,131,8],[132,7,132,8],[132,1,132,6]]}
["Summary of Review"]
["Manufacturer","Maine Energy Systems"]
["Model","Pellematic Smart XS",null,null,"Type","Boiler",null,"Condensing mode"]
["Rated heat output (kw)",18,null,"Rated heat output (Btu/hr)",null,null,61400]
["Water jacket vol. (gal)","Not reported"]
["Original AK List Status","No determination ",null,null,null,null,null,"ATM used - no low load or cyclic testing"]
["Dec. Logic Determination","Remains on No Determination List"]
["Current AK List Status","No determination "]
["Submission Docs","Determination",null,null,null,null,null,"Notes"]
["Full test report","Partially reported major"]
["Warranty information","Not reported",null,"Owners manual",null,"Partially reported major"]
["Submission date",null,null,"Review date"]
["Testing Information","Determination",null,null,null,null,null,"Notes"]
["Test method","ASTM 2618"]
["Test fuel","Pellet"]
["Test lab","RISE"]
["Third party certifier","RISE"]
["Test Report Elements","Determination",null,null,null,null,null,"Notes"]
["Overall PM emissions (g/hr)",0.623,null,"PM Highest 1-hr (g/hr)",null,null,1.22]
["Overall HHV efficiency (%)",94.5,null,"Max heat output (Btu/hr)",null,null,"NR"]
["Overall CO (g/hr)",{"$f":"IF(G21=\"\",\"\",IFERROR(G21*60,\"NR\"))","v":1.6199999999999999},null,"Overall CO (g/min)",null,null,2.7E-2]
["Total PM emissions","Less than 18.0 (g)"]
["Manufacturers Instructions to lab","Not reported",null,null,null,null,null,"no appliances settings included in the report. "]
["Efficiency  calculations","Not reported"]
["Overall SLM efficiency (%)","Lower than delivered efficiency (HHV basis)"]
["Burn rate calculations","Not reported"]
["Raw data sheets","Not reported"]
["Pre-burn completed by","Manufacturer"]
["Pre-burn data","Not reported",null,null,null,null,null,"50 hours of aging"]
["Pre-burn data","Not reported",null,null,null,null,null,"50 hours at medium burn rate"]
["Lab technician notes","Not reported"]
["Doc. of run appropriateness","Not reported"]
["Filter data","Reported"]
["Train precision (%)","Not reported"]
["Negative weights","Not reported"]
["Negs handled appropriately","Not reported"]
["Proportionality","Reported"]
["Doc. of run validity","Not reported"]
["Doc. of run anomolies","Not reported"]
["Doc. of run burn rates","Not reported"]
["Test Run Data","Determination",null,null,null,null,null,"Notes"]
["Data Summary Part A"]
["Run Category",null,"I","II","III","IV"]
["Run date",null,"2018-06-11","2018-05-11","2018-02-11","2018-01-11"]
["Run #",null,1,1,1,1]
["Target Load (Btu/hr)",null,"<21,490",32542,46664,61400]
["Actual Load (Btu/hr)",null,20357,31241,44831,64851]
["Actual Load (% of max)",null,33.200000000000003,50.9,73,105.6]
["Total burn time (hr)",null,4,4,4,4]
["Wfuel (lb)",null,10.8,17,23.2,33.799999999999997,null,"Fuel charge weight, as-fired or \"wet\""]
["MCave (%)",null,7.5,7.5,7.5,7.5,null,"Fuel moisture content - dry basis"]
["Qin (Btu)",null,86420,135627,185892,270019,null,"Total heat input (Btu) - in fuel charge (HHV)"]
["Qout (Btu)",null,81426,124964,179323,259405,null,"Total heat output (Btu)"]
["Data Summary Part B"]
["T2Min (F)",null,92,94,92,88]
["ET (g)",null,2.62,2.31,2.25,3.15,null,"Total PM emissions"]
["E (lb/MMBtu)",null,7.0999999999999994E-2,4.1000000000000002E-2,2.8000000000000001E-2,2.7E-2,null,"PM Emission rate per unit of heat output"]
["E (g/MJ)",null,0.03,1.7000000000000001E-2,1.2E-2,1.2E-2,null,"PM Emission rate per unit of heat output"]
["E (g/hr)",null,0.66,0.58199999999999996,0.56899999999999995,0.79700000000000004,null,"PM Emission rate per hour"]
["E (g/hr) 1st hour",null,1.22,1.1200000000000001,0.87,1.17,null,"PM Emission rate first hour"]
["E (g/kg)",null,0.57399999999999995,0.32200000000000001,0.22900000000000001,0.221,null,"PM Emission factor per kg of fuel"]
["ηdel",null,94.2,92.1,96.5,96.1,null,"Delivered efficiency HHV basis"]
["ηSLM",null,90.5,90.3,90.2,90.1,null,"Efficiency (HHV) based on stack loss method"]
["Data Summary Part C"]
["Startup time (min)","Not reported"]
["Steady-state time (min)","Not reported"]
["End time (min)","Not reported"]
["CO1 (g)","Not reported",null,null,null,null,null,"Startup CO emission"]
["CO2 (g)","Not reported",null,null,null,null,null,"Steady-state CO emission"]
["CO3 (g)","Not reported",null,null,null,null,null,"End CO emission"]
["COT (g)","Not reported",null,null,null,null,null,"Total CO emission"]
["COCH (ppm)","Not reported",null,null,null,null,null,"Average CO, chimney"]
["CODT (ppm)","Not reported",null,null,null,null,null,"Average CO, dilution tunnel"]
["Data Summary Part E"]
["E1 (g)","Not reported",null,null,null,null,null,"Startup PM emission"]
["E2 (g)","Not reported",null,null,null,null,null,"Steady-state PM emission"]
["E3 (g)","Not reported",null,null,null,null,null,"End PM emission"]
["E1 factor (g/kg)","Not reported",null,null,null,null,null,"Startup PM emission factor"]
["E2 factor (g/kg)","Not reported",null,null,null,null,null,"Steady-state PM emission factor"]
["E3 factor (g/kg)","Not reported",null,null,null,null,null,"End PM emission factor"]
["Year-Round Use Weighting"]
["Fi",null,0.437,0.23799999999999999,0.27500000000000002,0.05,null,"Year round use weighting factors"]
["ηdelxFi (%)",null,41.17,21.93,26.54,4.8099999999999996,null,"Weighted delivered efficiency HHV basis"]
["Eg/MJxFi (g/MJ)",null,1.3100000000000001E-2,4.0000000000000001E-3,3.3E-3,5.9999999999999995E-4,null,"Weighted emission rate"]
["Eg/kgxFi (g/kg)",null,0.25080000000000002,7.6600000000000001E-2,6.3E-2,1.11E-2,null,"Weighted emission rate"]
["Elb/mmBtuxFi (lb/MMBtu)",null,3.1E-2,9.7999999999999997E-3,7.7000000000000002E-3,1.4E-3,null,"Weighted emission rate"]
["Eg/hrxFi (g/h)",null,0.28839999999999999,0.13850000000000001,0.1565,3.9899999999999998E-2,null,"Weighted emission factor in gram per hour"]
["COg/minxFi",null,2.0199999999999999E-2,5.0000000000000001E-3,1.9E-3,2.0000000000000001E-4,null,"CO weighted emission factor in gram per minute"]
["Other Measurements"]
["Tiavg (F)",null,112,112,111,106,null,"Avg. temp. of the appliance and water at start of the test"]
["TFavg (F)",null,111,113,110,106,null,"Avg. tem. of the appliance and water at the end of the test"]
["T6 (F)",null,93,94,93,88,null,"Temp. of the hot water supply as it enters the appliance"]
["T5 (F)",null,130,131,127,124,null,"Temp. of the hot water supply as it leaves the appliance"]
["T3 (F)",null,82,82,79,72,null,"Water temp. at the heath exchanger inlet - load side"]
["T4 (F)",null,119,119,115,108,null,"Water temp. at the heath exchanger outlet - load side"]
["WRemainingFuel",null,null,null,null,null,null,"Weight of unburned fuel at the end of a test"]
["Vf (gal/min)",null,1.1399999999999999,1.66,2.4900000000000002,3.58,null,"Load side volumetric liquid flow rate"]
["VfS","Not reported",null,null,null,null,null,"Supply side volumetric liquid flow rate"]
["ηdelLHV (%)",null,101.4,99.2,103.9,103.4,null,"Delivered efficiency LHV basis"]
["QinLHV (%)","Not reported",null,null,null,null,null,"Heat input (LHV)"]
["All run data"]
["Low Burn Rate Tested","Not reported"]
["Appliance Fueling","Determination",null,null,null,null,null,"Notes"]
["Pellet species/type","Not reported"]
["Pellet fuel certification","EN Plus"]
["Source of the pellet specification","Lab analysis"]
["Owners Manual Req.","Determination",null,null,null,null,null,"Notes"]
["Stack height","Included"]
["Location recommendation","Included"]
["Guidance on proper draft","Included"]
["Fuel loading & reloading","Included"]
["Fuel selection recomm.","Included"]
["Improper fuels warnings","Included"]
["Fire starting procedures","Included"]
["Proper use of air controls","Included"]
["Proper operation low","Included"]
["Ash removal procedures","Included"]
["Replacement parts","Not included"]
["Federal warning (C or NC)","Included"]
["Warranty rights","Not included"]
["Reporting","Determination",null,null,null,null,null,"Notes"]
["Test report complete","Partially reported"]
["Owner manual complete","Partially reported"]
["Lab receipt dates","2018-10-18"]
["Aging dates","Not reported"]
["Test dates","Nov 1-6, 2018"]
["30 Day notice submitted to EPA","No"]
["Tested on the proposed date","Cannot be determined"]
["Tested in consecutive days","No"]
["60 Day report to EPA","Cannot be determined"]
["Website","Determination",null,null,null,null,null,"Notes"]
["Website address:","https://www.oekofen.com/assets/download/Englisch/PellematicSmartXS/Technische%20Daten/TD_SmartXS_en_aktuell.pdf"]
["PM emissions (g/h)","NR"]
["HHV efficiency (%)","NR",null,"Rated heat output (Btu/hr)",null,null,61400]
["OECA Referall?"]

{"sheet":"MESYS - Pellematic Smart XS-Non","index":2,"n_rows":135,"n_cols":8,"rows_kept":135,"cut":false,"hidden":false,"merged":[[0,0,0,8],[1,1,1,6],[1,7,1,8],[2,1,2,3],[2,5,2,6],[2,7,2,8],[8,1,8,6],[8,7,8,8],[3,1,3,2],[3,3,3,5],[3,7,3,8],[4,1,4,6],[4,7,4,8],[5,1,5,6],[5,7,5,8],[6,1,6,6],[7,1,7,6],[11,1,11,2],[11,3,11,4],[11,5,11,6],[11,7,11,8],[12,1,12,6],[12,7,12,8],[9,1,9,6],[9,7,9,8],[10,1,10,2],[10,3,10,4],[10,5,10,6],[10,7,10,8],[16,1,16,6],[16,7,16,8],[17,1,17,6],[17,7,17,8],[18,1,18,2],[18,3,18,5],[18,7,18,8],[13,1,13,6],[13,7,13,8],[14,1,14,6],[14,7,14,8],[15,1,15,6],[15,7,15,8],[21,1,21,6],[21,7,21,8],[22,1,22,6],[22,7,22,8],[19,1,19,2],[19,3,19,5],[19,7,19,8],[20,1,20,2],[20,3,20,5],[20,7,20,8],[27,1,27,6],[27,7,27,8],[28,1,28,6],[28,7,28,8],[29,1,29,6],[29,7,29,8],[23,1,23,6],[23,7,23,8],[25,1,25,6],[25,7,25,8],[26,1,26,6],[26,7,26,8],[24,1,24,6],[24,7,24,8],[33,1,33,6],[33,7,33,8],[34,1,34,6],[34,7,34,8],[35,1,35,6],[35,7,35,8],[30,1,30,6],[30,7,30,8],[31,1,31,6],[31,7,31,8],[32,1,32,6],[32,7,32,8],[39,1,39,6],[39,7,39,8],[40,1,40,6],[40,7,40,8],[41,0,41,8],[42,7,42,8],[36,1,36,6],[36,7,36,8],[37,1,37,6],[37,7,37,8],[38,1,38,6],[38,7,38,8],[49,7,49,8],[50,7,50,8],[51,7,51,8],[52,7,52,8],[53,0,53,8],[54,7,54,8],[43,7,43,8],[44,7,44,8],[45,7,45,8],[46,7,46,8],[47,7,47,8],[48,7,48,8],[62,7,62,8],[63,0,63,8],[64,7,64,8],[65,7,65,8],[66,7,66,8],[67,7,67,8],[55,7,55,8],[56,7,56,8],[57,7,57,8],[58,7,58,8],[60,7,60,8],[61,7,61,8],[59,7,59,8],[74,7,74,8],[75,7,75,8],[76,7,76,8],[77,7,77,8],[78,7,78,8],[79,7,79,8],[68,7,68,8],[69,7,69,8],[70,7,70,8],[71,7,71,8],[72,7,72,8],[73,0,73,8],[86,7,86,8],[87,7,87,8],[88,0,88,8],[89,7,89,8],[90,7,90,8],[91,7,91,8],[80,0,80,8],[81,7,81,8],[82,7,82,8],[83,7,83,8],[84,7,84,8],[85,7,85,8],[100,1,100,6],[100,7,100,8],[102,1,102,6],[102,7,102,8],[103,1,103,6],[103,7,103,8],[92,7,92,8],[93,7,93,8],[94,7,94,8],[95,7,95,8],[98,7,98,8],[99,7,99,8],[101,1,101,6],[101,7,101,8],[107,1,107,6],[107,7,107,8],[108,1,108,6],[108,7,108,8],[109,1,109,6],[109,7,109,8],[104,1,104,6],[104,7,104,8],[105,1,105,6],[105,7,105,8],[106,1,106,6],[106,7,106,8],[113,1,113,6],[113,7,113,8],[114,1,114,6],[114,7,114,8],[115,1,115,6],[115,7,115,8],[110,1,110,6],[110,7,110,8],[111,1,111,6],[111,7,111,8],[112,1,112,6],[112,7,112,8],[119,1,119,6],[119,7,119,8],[120,1,120,6],[120,7,120,8],[121,1,121,6],[121,7,121,8],[116,1,116,6],[116,7,116,8],[117,1,117,6],[117,7,117,8],[118,1,118,6],[118,7,118,8],[125,1,125,6],[125,7,125,8],[126,1,126,6],[126,7,126,8],[127,1,127,6],[127,7,127,8],[122,1,122,6],[122,7,122,8],[123,1,123,6],[123,7,123,8],[124,1,124,6],[124,7,124,8],[134,1,134,8],[131,1,131,6],[131,7,131,8],[132,1,132,6],[132,7,132,8],[133,1,133,2],[133,3,133,5],[133,7,133,8],[128,1,128,6],[128,7,128,8],[129,1,129,6],[129,7,129,8],[130,1,130,6],[130,7,130,8]]}
["Summary of Review"]
["Manufacturer","Maine Energy Systems"]
["Model","Pellematic Smart XS",null,null,"Type","Boiler",null,"Non-Condensing mode"]
["Rated heat output (kw)",18,null,"Rated heat output (Btu/hr)",null,null,61400]
["Water jacket vol. (gal)","Not reported"]
["Original AK List Status","No determination ",null,null,null,null,null,"ATM used - no low load or cyclic testing"]
["Dec. Logic Determination","Remains on No Determination List"]
["Current AK List Status","No determination "]
["Submission Docs","Determination",null,null,null,null,null,"Notes"]
["Full test report","Partially reported major"]
["Warranty information","Not reported",null,"Owners manual",null,"Partially reported major"]
["Submission date",null,null,"Review date"]
["Testing Information","Determination",null,null,null,null,null,"Notes"]
["Test method","ASTM 2618"]
["Test fuel","Pellet"]
["Test lab","RISE"]
["Third party certifier","RISE"]
["Test Report Elements","Determination",null,null,null,null,null,"Notes"]
["Overall PM emissions (g/hr)",0.56699999999999995,null,"PM Highest 1-hr (g/hr)",null,null,3.01]
["Overall HHV efficiency (%)",87,null,"Max heat output (Btu/hr)",null,null,"NR"]
["Overall CO (g/hr)",{"$f":"IF(G21=\"\",\"\",IFERROR(G21*60,\"NR\"))","v":2.1599999999999997},null,"Overall CO (g/min)",null,null,3.5999999999999997E-2]
["Total PM emissions","Less than 18.0 (g)"]
["Manufacturers Instructions to lab","Not reported",null,null,null,null,null,"no appliances settings included in the report. "]
["Efficiency  calculations","Not reported"]
["Overall SLM efficiency (%)","Lower than delivered efficiency (HHV basis)",null,null,null,null,null,"1 RUN LESS THAN 5%"]
["Burn rate calculations","Not reported"]
["Raw data sheets","Not reported"]
["Pre-burn completed by","Manufacturer"]
["Pre-burn data","Not reported",null,null,null,null,null,"50 hours of aging"]
["Pre-burn data","Not reported",null,null,null,null,null,"50 hours at medium burn rate"]
["Lab technician notes","Not reported"]
["Doc. of run appropriateness","Not reported"]
["Filter data","Reported"]
["Train precision (%)","Not reported"]
["Negative weights","Not reported"]
["Negs handled appropriately","Not reported"]
["Proportionality","Reported"]
["Doc. of run validity","Not reported"]
["Doc. of run anomolies","Not reported"]
["Doc. of run burn rates","Not reported"]
["Test Run Data","Determination",null,null,null,null,null,"Notes"]
["Data Summary Part A"]
["Run Category",null,"I","II","III","IV"]
["Run date",null,"31/10/18","30/10/18","30/10/18","29/10/18"]
["Run #",null,1,1,1,1]
["Target Load (Btu/hr)",null,"<21,490",32542,46664,61400]
["Actual Load (Btu/hr)",null,20460,27102,41364,61179]
["Actual Load (% of max)",null,33.299999999999997,44.1,67.3,99.6]
["Total burn time (hr)",null,4,4,4,4]
["Wfuel (lb)",null,12.1,15,23.3,36,null,"Fuel charge weight, as-fired or \"wet\""]
["MCave (%)",null,7.5,7.5,7.5,7.5,null,"Fuel moisture content - dry basis"]
["Qin (Btu)",null,97002,120107,186774,287656,null,"Total heat input (Btu) - in fuel charge (HHV)"]
["Qout (Btu)",null,81839,108406,165456,244717,null,"Total heat output (Btu)"]
["Data Summary Part B"]
["T2Min (F)",null,126,125,128,129]
["ET (g)",null,1.91,1.39,2.94,5.16,null,"Total PM emissions"]
["E (lb/MMBtu)",null,5.0999999999999997E-2,2.8000000000000001E-2,3.9E-2,4.5999999999999999E-2,null,"PM Emission rate per unit of heat output"]
["E (g/MJ)",null,2.1999999999999999E-2,1.2E-2,1.7000000000000001E-2,0.02,null,"PM Emission rate per unit of heat output"]
["E (g/hr)",null,0.48299999999999998,0.35399999999999998,0.749,1.3129999999999999,null,"PM Emission rate per hour"]
["E (g/hr) 1st hour",null,0.85,1.08,2.0499999999999998,3.01,null,"PM Emission rate first hour"]
["E (g/kg)",null,0.372,0.22,0.29799999999999999,0.34,null,"PM Emission factor per kg of fuel"]
["ηdel",null,84.4,90.3,88.6,85.1,null,"Delivered efficiency HHV basis"]
["ηSLM",null,89.8,89.8,89.6,89,null,"Efficiency (HHV) based on stack loss method"]
["Data Summary Part C"]
["Startup time (min)","Not reported"]
["Steady-state time (min)","Not reported"]
["End time (min)","Not reported"]
["CO1 (g)","Not reported",null,null,null,null,null,"Startup CO emission"]
["CO2 (g)","Not reported",null,null,null,null,null,"Steady-state CO emission"]
["CO3 (g)","Not reported",null,null,null,null,null,"End CO emission"]
["COT (g)","Not reported",null,null,null,null,null,"Total CO emission"]
["COCH (ppm)","Not reported",null,null,null,null,null,"Average CO, chimney"]
["CODT (ppm)","Not reported",null,null,null,null,null,"Average CO, dilution tunnel"]
["Data Summary Part E"]
["E1 (g)","Not reported",null,null,null,null,null,"Startup PM emission"]
["E2 (g)","Not reported",null,null,null,null,null,"Steady-state PM emission"]
["E3 (g)","Not reported",null,null,null,null,null,"End PM emission"]
["E1 factor (g/kg)","Not reported",null,null,null,null,null,"Startup PM emission factor"]
["E2 factor (g/kg)","Not reported",null,null,null,null,null,"Steady-state PM emission factor"]
["E3 factor (g/kg)","Not reported",null,null,null,null,null,"End PM emission factor"]
["Year-Round Use Weighting"]
["Fi",null,0.437,0.23799999999999999,0.27500000000000002,0.05,null,"Year round use weighting factors"]
["ηdelxFi (%)",null,36.880000000000003,21.49,24.37,4.26,null,"Weighted delivered efficiency HHV basis"]
["Eg/MJxFi (g/MJ)",null,9.5999999999999992E-3,2.8999999999999998E-3,4.7000000000000002E-3,1E-3,null,"Weighted emission rate"]
["Eg/kgxFi (g/kg)",null,0.16259999999999999,5.2400000000000002E-2,8.2000000000000003E-2,1.7000000000000001E-2,null,"Weighted emission rate"]
["Elb/mmBtuxFi (lb/MMBtu)",null,2.23E-2,6.7000000000000002E-3,1.0699999999999999E-2,2.3E-3,null,"Weighted emission rate"]
["Eg/hrxFi (g/h)",null,0.21110000000000001,8.43E-2,0.20599999999999999,6.5699999999999995E-2,null,"Weighted emission factor in gram per hour"]
["COg/minxFi",null,2.6100000000000002E-2,8.8999999999999999E-3,1E-3,4.0000000000000002E-4,null,"CO weighted emission factor in gram per minute"]
["Other Measurements"]
["Tiavg (F)",null,144,144,145,153,null,"Avg. temp. of the appliance and water at start of the test"]
["TFavg (F)",null,147,143,145,147,null,"Avg. tem. of the appliance and water at the end of the test"]
["T6 (F)",null,127,127,129,129,null,"Temp. of the hot water supply as it enters the appliance"]
["T5 (F)",null,165,162,163,165,null,"Temp. of the hot water supply as it leaves the appliance"]
["T3 (F)",null,118,117,117,115,null,"Water temp. at the heath exchanger inlet - load side"]
["T4 (F)",null,155,150,151,151,null,"Water temp. at the heath exchanger outlet - load side"]
["WRemainingFuel",null,null,null,null,null,null,"Weight of unburned fuel at the end of a test"]
["Vf (gal/min)",null,1.1000000000000001,1.66,2.4300000000000002,3.59,null,"Load side volumetric liquid flow rate"]
["VfS","Not reported",null,null,null,null,null,"Supply side volumetric liquid flow rate"]
["ηdelLHV (%)",null,90.8,97.2,95.4,91.6,null,"Delivered efficiency LHV basis"]
["QinLHV (%)","Not reported",null,null,null,null,null,"Heat input (LHV)"]
["All run data"]
["Low Burn Rate Tested","Not reported"]
["Appliance Fueling","Determination",null,null,null,null,null,"Notes"]
["Pellet species/type","Not reported"]
["Pellet fuel certification","EN Plus"]
["Source of the pellet specification","Lab analysis"]
["Owners Manual Req.","Determination",null,null,null,null,null,"Notes"]
["Stack height","Included"]
["Location recommendation","Included"]
["Guidance on proper draft","Included"]
["Fuel loading & reloading","Included"]
["Fuel selection recomm.","Included"]
["Improper fuels warnings","Included"]
["Fire starting procedures","Included"]
["Proper use of air controls","Included"]
["Proper operation low","Included"]
["Ash removal procedures","Included"]
["Replacement parts","Not included"]
["Federal warning (C or NC)","Included"]
["Warranty rights","Not included"]
["Reporting","Determination",null,null,null,null,null,"Notes"]
["Test report complete","Partially reported"]
["Owner manual complete","Partially reported"]
["Lab receipt dates","2018-10-18"]
["Aging dates","Not reported"]
["Test dates","October 29-31, 2018"]
["30 Day notice submitted to EPA","No"]
["Tested on the proposed date","Cannot be determined"]
["Tested in consecutive days","No"]
["60 Day report to EPA","Cannot be determined"]
["Website","Determination",null,null,null,null,null,"Notes"]
["Website address:","https://www.oekofen.com/assets/download/Englisch/PellematicSmartXS/Technische%20Daten/TD_SmartXS_en_aktuell.pdf"]
["PM emissions (g/h)","NR"]
["HHV efficiency (%)","NR",null,"Rated heat output (Btu/hr)",null,null,61400]
["OECA Referall?"]

{"sheet":"MESYS - Pellematic 20","index":3,"n_rows":135,"n_cols":8,"rows_kept":135,"cut":false,"hidden":false,"merged":[[13,1,13,6],[13,7,13,8],[14,1,14,6],[14,7,14,8],[15,1,15,6],[15,7,15,8],[11,1,11,2],[11,3,11,4],[11,5,11,6],[11,7,11,8],[12,1,12,6],[12,7,12,8],[0,0,0,8],[1,1,1,6],[1,7,1,8],[2,1,2,3],[2,5,2,6],[2,7,2,8],[9,1,9,6],[9,7,9,8],[10,1,10,2],[10,3,10,4],[10,5,10,6],[10,7,10,8],[8,1,8,6],[8,7,8,8],[5,1,5,6],[5,7,5,8],[6,1,6,6],[7,1,7,6],[3,1,3,2],[3,3,3,5],[3,7,3,8],[4,1,4,6],[4,7,4,8],[19,3,19,5],[19,7,19,8],[20,1,20,2],[20,3,20,5],[20,7,20,8],[16,1,16,6],[16,7,16,8],[17,1,17,6],[17,7,17,8],[18,1,18,2],[18,3,18,5],[18,7,18,8],[19,1,19,2],[23,1,23,6],[23,7,23,8],[25,1,25,6],[25,7,25,8],[26,1,26,6],[26,7,26,8],[24,1,24,6],[24,7,24,8],[21,1,21,6],[21,7,21,8],[22,1,22,6],[22,7,22,8],[30,1,30,6],[30,7,30,8],[31,1,31,6],[31,7,31,8],[32,1,32,6],[32,7,32,8],[27,1,27,6],[27,7,27,8],[28,1,28,6],[28,7,28,8],[29,1,29,6],[29,7,29,8],[36,1,36,6],[36,7,36,8],[37,1,37,6],[37,7,37,8],[38,1,38,6],[38,7,38,8],[33,1,33,6],[33,7,33,8],[34,1,34,6],[34,7,34,8],[35,1,35,6],[35,7,35,8],[43,7,43,8],[44,7,44,8],[45,7,45,8],[46,7,46,8],[47,7,47,8],[48,7,48,8],[39,1,39,6],[39,7,39,8],[40,1,40,6],[40,7,40,8],[41,0,41,8],[42,7,42,8],[55,7,55,8],[56,7,56,8],[57,7,57,8],[58,7,58,8],[60,7,60,8],[61,7,61,8],[49,7,49,8],[50,7,50,8],[51,7,51,8],[52,7,52,8],[53,0,53,8],[54,7,54,8],[59,7,59,8],[68,7,68,8],[69,7,69,8],[70,7,70,8],[71,7,71,8],[72,7,72,8],[73,0,73,8],[62,7,62,8],[63,0,63,8],[64,7,64,8],[65,7,65,8],[66,7,66,8],[67,7,67,8],[80,0,80,8],[81,7,81,8],[82,7,82,8],[83,7,83,8],[84,7,84,8],[85,7,85,8],[74,7,74,8],[75,7,75,8],[76,7,76,8],[77,7,77,8],[78,7,78,8],[79,7,79,8],[93,7,93,8],[94,7,94,8],[95,7,95,8],[98,7,98,8],[86,7,86,8],[88,0,88,8],[89,7,89,8],[90,7,90,8],[91,7,91,8],[92,7,92,8],[104,1,104,6],[104,7,104,8],[105,1,105,6],[105,7,105,8],[106,1,106,6],[106,7,106,8],[99,7,99,8],[100,1,100,6],[100,7,100,8],[102,1,102,6],[102,7,102,8],[103,1,103,6],[103,7,103,8],[101,1,101,6],[101,7,101,8],[110,1,110,6],[110,7,110,8],[111,1,111,6],[111,7,111,8],[112,1,112,6],[112,7,112,8],[107,1,107,6],[107,7,107,8],[108,1,108,6],[108,7,108,8],[109,1,109,6],[109,7,109,8],[116,1,116,6],[116,7,116,8],[117,1,117,6],[117,7,117,8],[118,1,118,6],[118,7,118,8],[113,1,113,6],[113,7,113,8],[114,1,114,6],[114,7,114,8],[115,1,115,6],[115,7,115,8],[123,7,123,8],[124,1,124,6],[124,7,124,8],[119,1,119,6],[119,7,119,8],[120,1,120,6],[120,7,120,8],[121,1,121,6],[121,7,121,8],[134,1,134,8],[87,7,87,8],[131,1,131,6],[131,7,131,8],[132,1,132,6],[132,7,132,8],[133,1,133,2],[133,3,133,5],[133,7,133,8],[128,1,128,6],[128,7,128,8],[129,1,129,6],[129,7,129,8],[130,1,130,6],[130,7,130,8],[125,1,125,6],[125,7,125,8],[126,1,126,6],[126,7,126,8],[127,1,127,6],[127,7,127,8],[122,1,122,6],[122,7,122,8],[123,1,123,6]]}
["Summary of Review"]
["Manufacturer","Maine Energy Systems"]
["Model","Pellematic 20",null,null,"Type","Boiler"]
["Rated heat output (kw)",20,null,"Rated heat output (Btu/hr)",null,null,68300]
["Water jacket vol. (gal)",15]
["Original AK List Status","Approved List"]
["Dec. Logic Determination","Move to No Determination List"]
["Current AK List Status","Approved List - Pending"]
["Submission Docs","Determination",null,null,null,null,null,"Notes"]
["Full test report","Partially reported major"]
["Warranty information","Not reported",null,"Owners manual",null,"Partially reported major"]
["Submission date",null,null,"Review date"]
["Testing Information","Determination",null,null,null,null,null,"Notes"]
["Test method","ASTM 2618"]
["Test fuel","Pellet"]
["Test lab","RISE"]
["Third party certifier","RISE"]
["Test Report Elements","Determination",null,null,null,null,null,"Notes"]
["Overall PM emissions (g/hr)",0.22700000000000001,null,"PM Highest 1-hr (g/hr)",null,null,1.66]
["Overall HHV efficiency (%)",74.3,null,"Max heat output (Btu/hr)",null,null,68300]
["Overall CO (g/hr)",{"$f":"IF(G21=\"\",\"\",IFERROR(G21*60,\"NR\"))","v":1.1399999999999999},null,"Overall CO (g/min)",null,null,1.9E-2]
["Total PM emissions","Less than 18.0 (g)"]
["Manufacturers Instructions to lab","Not reported",null,null,null,null,null,"no appliances settings included in the report. "]
["Efficiency  calculations","Not reported"]
["Overall SLM efficiency (%)","Higher than delivered efficiency (HHV basis)"]
["Burn rate calculations","Not reported"]
["Raw data sheets","Not reported"]
["Pre-burn completed by","Not reported"]
["Pre-burn data","Not reported",null,null,null,null,null,"50 hours of aging"]
["Pre-burn data","Not reported",null,null,null,null,null,"50 hours at medium burn rate"]
["Lab technician notes","Not reported"]
["Doc. of run appropriateness","Not reported"]
["Filter data","Reported"]
["Train precision (%)","Not reported"]
["Negative weights","Not reported"]
["Negs handled appropriately","Not reported"]
["Proportionality","Reported"]
["Doc. of run validity","Not reported"]
["Doc. of run anomolies","Not reported"]
["Doc. of run burn rates","Not reported"]
["Test Run Data","Determination",null,null,null,null,null,"Notes"]
["Data Summary Part A"]
["Run Category",null,"I","II","III","IV"]
["Run date",null,"27/01/2020","28/01/2020","29/01/2020","30/1/2020"]
["Run #",null,1,1,1,1]
["Target Load (Btu/hr)",null,"<10,245",16392,34150,68300]
["Actual Load (Btu/hr)",null,9323,15270,32229,70418]
["Actual Load (% of max)",null,13.7,22.4,47.2,103.1]
["Total burn time (hr)",null,4,4,4,4]
["Wfuel (lb)",null,6.83,9.7100000000000009,19.84,43.4,null,"Fuel charge weight, as-fired or \"wet\""]
["MCave (%)",null,6.6,6.6,6.6,6.6,null,"Fuel moisture content - dry basis"]
["Qin (Btu)",null,55078,78363,160075,350225,null,"Total heat input (Btu) - in fuel charge (HHV)"]
["Qout (Btu)",null,37293,61078,128917,281674,null,"Total heat output (Btu)"]
["Data Summary Part B"]
["T2Min (F)",null,132,128,126,124]
["ET (g)",null,0.68,0.53,0.98,4.2300000000000004,null,"Total PM emissions"]
["E (lb/MMBtu)",null,0.04,1.9E-2,1.7000000000000001E-2,2.9000000000000001E-2,null,"PM Emission rate per unit of heat output"]
["E (g/MJ)",null,1.7000000000000001E-2,8.0000000000000002E-3,7.0000000000000001E-3,1.4E-2,null,"PM Emission rate per unit of heat output"]
["E (g/hr)",null,0.17100000000000001,0.13300000000000001,0.245,1.0609999999999999,null,"PM Emission rate per hour"]
["E (g/hr) 1st hour",null,0.17,0.13,0.17,1.66,null,"PM Emission rate first hour"]
["E (g/kg)",null,0.23599999999999999,0.129,0.11600000000000001,0.23,null,"PM Emission factor per kg of fuel"]
["ηdel",null,67.7,77.900000000000006,80.5,80.400000000000006,null,"Delivered efficiency HHV basis"]
["ηSLM",null,86,87.4,85.3,83.2,null,"Efficiency (HHV) based on stack loss method"]
["Data Summary Part C"]
["Startup time (min)","Not reported"]
["Steady-state time (min)","Not reported"]
["End time (min)","Not reported"]
["CO1 (g)","Not reported",null,null,null,null,null,"Startup CO emission"]
["CO2 (g)","Not reported",null,null,null,null,null,"Steady-state CO emission"]
["CO3 (g)","Not reported",null,null,null,null,null,"End CO emission"]
["COT (g)","Not reported",null,null,null,null,null,"Total CO emission"]
["COCH (ppm)","Not reported",null,null,null,null,null,"Average CO, chimney"]
["CODT (ppm)","Not reported",null,null,null,null,null,"Average CO, dilution tunnel"]
["Data Summary Part E"]
["E1 (g)","Not reported",null,null,null,null,null,"Startup PM emission"]
["E2 (g)","Not reported",null,null,null,null,null,"Steady-state PM emission"]
["E3 (g)","Not reported",null,null,null,null,null,"End PM emission"]
["E1 factor (g/kg)","Not reported",null,null,null,null,null,"Startup PM emission factor"]
["E2 factor (g/kg)","Not reported",null,null,null,null,null,"Steady-state PM emission factor"]
["E3 factor (g/kg)","Not reported",null,null,null,null,null,"End PM emission factor"]
["Year-Round Use Weighting"]
["Fi",null,0.437,0.23799999999999999,0.27500000000000002,0.05,null,"Year round use weighting factors"]
["ηdelxFi (%)",null,29.58,18.54,22.14,4.0199999999999996,null,"Weighted delivered efficiency HHV basis"]
["Eg/MJxFi (g/MJ)",null,7.4000000000000003E-3,1.9E-3,1.9E-3,6.9999999999999999E-4,null,"Weighted emission rate"]
["Eg/kgxFi (g/kg)",null,0.1031,3.0700000000000002E-2,3.1899999999999998E-2,1.15E-2,null,"Weighted emission rate"]
["Elb/mmBtuxFi (lb/MMBtu)",null,1.7500000000000002E-2,4.4999999999999997E-3,4.7000000000000002E-3,1.5E-3,null,"Weighted emission rate"]
["Eg/hrxFi (g/h)",null,7.4700000000000003E-2,3.1699999999999999E-2,6.7400000000000002E-2,5.3100000000000001E-2,null,"Weighted emission factor in gram per hour"]
["COg/minxFi",null,1.18E-2,1.9E-3,3.8999999999999998E-3,1.4E-3,null,"CO weighted emission factor in gram per minute"]
["Other Measurements"]
["Tiavg (F)",null,148,150,147,144,null,"Avg. temp. of the appliance and water at start of the test"]
["TFavg (F)",null,152,148,146,144,null,"Avg. tem. of the appliance and water at the end of the test"]
["T6 (F)",null,135,131,129,126,null,"Temp. of the hot water supply as it enters the appliance"]
["T5 (F)",null,165,167,163,163,null,"Temp. of the hot water supply as it leaves the appliance"]
["T3 (F)",null,111,113,111,111,null,"Water temp. at the heath exchanger inlet - load side"]
["T4 (F)",null,120,127,136,149,null,"Water temp. at the heath exchanger outlet - load side"]
["WRemainingFuel",null,null,null,null,null,null,"Weight of unburned fuel at the end of a test"]
["Vf (gal/min)",null,2.0699999999999998,2.1800000000000002,2.6,3.76,null,"Load side volumetric liquid flow rate"]
["VfS","Not reported",null,null,null,null,null,"Supply side volumetric liquid flow rate"]
["ηdelLHV (%)",null,72.900000000000006,83.9,86.7,86.6,null,"Delivered efficiency LHV basis"]
["QinLHV (%)","Not reported",null,null,null,null,null,"Heat input (LHV)"]
["All run data"]
["Low Burn Rate Tested","Not reported"]
["Appliance Fueling","Determination",null,null,null,null,null,"Notes"]
["Pellet species/type","Not reported"]
["Pellet fuel certification","EN Plus and A1"]
["Source of the pellet specification","Default values for oak"]
["Owners Manual Req.","Determination",null,null,null,null,null,"Notes"]
["Stack height","Included"]
["Location recommendation","Included"]
["Guidance on proper draft","Included"]
["Fuel loading & reloading","Included"]
["Fuel selection recomm.","Included"]
["Improper fuels warnings","Included"]
["Fire starting procedures","Included"]
["Proper use of air controls","Included"]
["Proper operation low","Included"]
["Ash removal procedures","Included"]
["Replacement parts","Not included"]
["Federal warning (C or NC)","Included"]
["Warranty rights","Not included"]
["Reporting","Determination",null,null,null,null,null,"Notes"]
["Test report complete","Partially reported"]
["Owner manual complete","Partially reported"]
["Lab receipt dates","2019-11-21"]
["Aging dates","Not reported"]
["Test dates","27th to 30th of January 2020"]
["30 Day notice submitted to EPA","Cannot be determined"]
["Tested on the proposed date","Cannot be determined"]
["Tested in consecutive days","Yes"]
["60 Day report to EPA","Cannot be determined"]
["Website","Determination",null,null,null,null,null,"Notes"]
["Website address:","https://www.maineenergysystems.com/autopellet-boiler-specifications/"]
["PM emissions (g/h)","Not reported"]
["HHV efficiency (%)","NR",null,"Rated heat output (Btu/hr)",null,null,68300]
["OECA Referall?"]

{"sheet":"MESYS - Pellematic 32","index":4,"n_rows":135,"n_cols":8,"rows_kept":135,"cut":false,"hidden":false,"merged":[[5,1,5,6],[5,7,5,8],[6,1,6,6],[7,1,7,6],[101,1,101,6],[101,7,101,8],[0,0,0,8],[1,1,1,6],[1,7,1,8],[2,1,2,3],[2,5,2,6],[2,7,2,8],[59,7,59,8],[8,1,8,6],[8,7,8,8],[3,1,3,2],[3,3,3,5],[3,7,3,8],[4,1,4,6],[4,7,4,8],[11,1,11,2],[11,3,11,4],[11,5,11,6],[11,7,11,8],[12,1,12,6],[12,7,12,8],[9,1,9,6],[9,7,9,8],[10,1,10,2],[10,3,10,4],[10,5,10,6],[10,7,10,8],[16,1,16,6],[16,7,16,8],[17,1,17,6],[17,7,17,8],[18,1,18,2],[18,3,18,5],[18,7,18,8],[13,1,13,6],[13,7,13,8],[14,1,14,6],[14,7,14,8],[15,1,15,6],[15,7,15,8],[21,1,21,6],[21,7,21,8],[22,1,22,6],[22,7,22,8],[19,1,19,2],[19,3,19,5],[19,7,19,8],[20,1,20,2],[20,3,20,5],[20,7,20,8],[27,1,27,6],[27,7,27,8],[28,1,28,6],[28,7,28,8],[29,1,29,6],[29,7,29,8],[23,1,23,6],[23,7,23,8],[25,1,25,6],[25,7,25,8],[26,1,26,6],[26,7,26,8],[24,1,24,6],[24,7,24,8],[33,1,33,6],[33,7,33,8],[34,1,34,6],[34,7,34,8],[35,1,35,6],[35,7,35,8],[30,1,30,6],[30,7,30,8],[31,1,31,6],[31,7,31,8],[32,1,32,6],[32,7,32,8],[39,1,39,6],[39,7,39,8],[40,1,40,6],[40,7,40,8],[41,0,41,8],[42,7,42,8],[36,1,36,6],[36,7,36,8],[37,1,37,6],[37,7,37,8],[38,1,38,6],[38,7,38,8],[49,7,49,8],[50,7,50,8],[51,7,51,8],[52,7,52,8],[53,0,53,8],[54,7,54,8],[43,7,43,8],[44,7,44,8],[45,7,45,8],[46,7,46,8],[47,7,47,8],[48,7,48,8],[62,7,62,8],[63,0,63,8],[64,7,64,8],[65,7,65,8],[66,7,66,8],[67,7,67,8],[55,7,55,8],[56,7,56,8],[57,7,57,8],[58,7,58,8],[60,7,60,8],[61,7,61,8],[74,7,74,8],[75,7,75,8],[76,7,76,8],[77,7,77,8],[78,7,78,8],[79,7,79,8],[68,7,68,8],[69,7,69,8],[70,7,70,8],[71,7,71,8],[72,7,72,8],[73,0,73,8],[86,7,86,8],[88,0,88,8],[89,7,89,8],[90,7,90,8],[91,7,91,8],[92,7,92,8],[87,7,87,8],[80,0,80,8],[81,7,81,8],[82,7,82,8],[83,7,83,8],[84,7,84,8],[85,7,85,8],[99,7,99,8],[100,1,100,6],[100,7,100,8],[102,1,102,6],[102,7,102,8],[103,1,103,6],[103,7,103,8],[93,7,93,8],[94,7,94,8],[95,7,95,8],[98,7,98,8],[107,1,107,6],[107,7,107,8],[108,1,108,6],[108,7,108,8],[109,1,109,6],[109,7,109,8],[104,1,104,6],[104,7,104,8],[105,1,105,6],[105,7,105,8],[106,1,106,6],[106,7,106,8],[113,1,113,6],[113,7,113,8],[114,1,114,6],[114,7,114,8],[115,1,115,6],[115,7,115,8],[110,1,110,6],[110,7,110,8],[111,1,111,6],[111,7,111,8],[112,1,112,6],[112,7,112,8],[119,1,119,6],[119,7,119,8],[120,1,120,6],[120,7,120,8],[121,1,121,6],[121,7,121,8],[116,1,116,6],[116,7,116,8],[117,1,117,6],[117,7,117,8],[118,1,118,6],[118,7,118,8],[134,1,134,8],[131,1,131,6],[131,7,131,8],[132,1,132,6],[132,7,132,8],[133,1,133,2],[133,3,133,5],[133,7,133,8],[128,1,128,6],[128,7,128,8],[129,1,129,6],[129,7,129,8],[130,1,130,6],[130,7,130,8],[125,1,125,6],[125,7,125,8],[126,1,126,6],[126,7,126,8],[127,1,127,6],[127,7,127,8],[122,1,122,6],[122,7,122,8],[123,1,123,6],[123,7,123,8],[124,1,124,6],[124,7,124,8]]}
["Summary of Review"]
["Manufacturer","Maine Energy Systems"]
["Model","Pellematic 32",null,null,"Type","Boiler"]
["Rated heat output (kw)",32,null,"Rated heat output (Btu/hr)",null,null,109000]
["Water jacket vol. (gal)","Not reported"]
["Original AK List Status","Approved List"]
["Dec. Logic Determination","Move to No Determination List"]
["Current AK List Status","Approved List - Pending"]
["Submission Docs","Determination",null,null,null,null,null,"Notes"]
["Full test report","Partially reported major"]
["Warranty information","Not reported",null,"Owners manual",null,"Partially reported major"]
["Submission date",null,null,"Review date"]
["Testing Information","Determination",null,null,null,null,null,"Notes"]
["Test method","ASTM 2618"]
["Test fuel","Pellet"]
["Test lab","RISE"]
["Third party certifier","RISE"]
["Test Report Elements","Determination",null,null,null,null,null,"Notes"]
["Overall PM emissions (g/hr)",0.31900000000000001,null,"PM Highest 1-hr (g/hr)",null,null,1.36]
["Overall HHV efficiency (%)",76.5,null,"Max heat output (Btu/hr)",null,null,109000]
["Overall CO (g/hr)",{"$f":"IF(G21=\"\",\"\",IFERROR(G21*60,\"NR\"))","v":1.5},null,"Overall CO (g/min)",null,null,2.5000000000000001E-2]
["Total PM emissions","Less than 18.0 (g)"]
["Manufacturers Instructions to lab","Not reported",null,null,null,null,null,"no appliances settings included in the report. "]
["Efficiency  calculations","Not reported"]
["Overall SLM efficiency (%)","Higher than delivered efficiency (HHV basis)"]
["Burn rate calculations","Not reported"]
["Raw data sheets","Not reported"]
["Pre-burn completed by","Not reported"]
["Pre-burn data","Not reported",null,null,null,null,null,"50 hours of aging"]
["Pre-burn data","Not reported",null,null,null,null,null,"50 hours at medium burn rate"]
["Lab technician notes","Not reported"]
["Doc. of run appropriateness","Not reported"]
["Filter data","Reported"]
["Train precision (%)","Not reported"]
["Negative weights","Not reported"]
["Negs handled appropriately","Not reported"]
["Proportionality","Reported"]
["Doc. of run validity","Not reported"]
["Doc. of run anomolies","Not reported"]
["Doc. of run burn rates","Not reported"]
["Test Run Data","Determination",null,null,null,null,null,"Notes"]
["Data Summary Part A"]
["Run Category",null,"I","II","III","IV"]
["Run date",null,"16/01/2020","15/01/2020","14/01/2020","13/01/2020"]
["Run #",null,1,1,1,1]
["Target Load (Btu/hr)",null,"< 16,350",26160,54500,109000]
["Actual Load (Btu/hr)",null,14771,23858,52369,106996]
["Actual Load (% of max)",null,13.6,21.9,48,98.2]
["Total burn time (hr)",null,4,4,4,4]
["Wfuel (lb)",null,10.47,14.54,31.96,63.46,null,"Fuel charge weight, as-fired or \"wet\""]
["MCave (%)",null,6.7,6.7,6.7,6.7,null,"Fuel moisture content - dry basis"]
["Qin (Btu)",null,84440,117214,257642,511579,null,"Total heat input (Btu) - in fuel charge (HHV)"]
["Qout (Btu)",null,59083,95431,209477,427985,null,"Total heat output (Btu)"]
["Data Summary Part B"]
["T2Min (F)",null,127,121,123,125]
["ET (g)",null,0.48,0.98,2.0699999999999998,5.2,null,"Total PM emissions"]
["E (lb/MMBtu)",null,1.7999999999999999E-2,2.3E-2,2.1999999999999999E-2,2.7E-2,null,"PM Emission rate per unit of heat output"]
["E (g/MJ)",null,8.0000000000000002E-3,0.01,8.9999999999999993E-3,1.2E-2,null,"PM Emission rate per unit of heat output"]
["E (g/hr)",null,0.122,0.245,0.51800000000000002,1.3049999999999999,null,"PM Emission rate per hour"]
["E (g/hr) 1st hour",null,0.15,0.32,0.78,1.36,null,"PM Emission rate first hour"]
["E (g/kg)",null,0.109,0.159,0.153,0.193,null,"PM Emission factor per kg of fuel"]
["ηdel",null,70,81.400000000000006,81.3,83.7,null,"Delivered efficiency HHV basis"]
["ηSLM",null,83.8,86,85.9,84.3,null,"Efficiency (HHV) based on stack loss method"]
["Data Summary Part C"]
["Startup time (min)","Not reported"]
["Steady-state time (min)","Not reported"]
["End time (min)","Not reported"]
["CO1 (g)","Not reported",null,null,null,null,null,"Startup CO emission"]
["CO2 (g)","Not reported",null,null,null,null,null,"Steady-state CO emission"]
["CO3 (g)","Not reported",null,null,null,null,null,"End CO emission"]
["COT (g)","Not reported",null,null,null,null,null,"Total CO emission"]
["COCH (ppm)",null,null,85,39,13,98,"Average CO, chimney"]
["CODT (ppm)","Not reported",null,null,null,null,null,"Average CO, dilution tunnel"]
["Data Summary Part E"]
["E1 (g)","Not reported",null,null,null,null,null,"Startup PM emission"]
["E2 (g)","Not reported",null,null,null,null,null,"Steady-state PM emission"]
["E3 (g)","Not reported",null,null,null,null,null,"End PM emission"]
["E1 factor (g/kg)","Not reported",null,null,null,null,null,"Startup PM emission factor"]
["E2 factor (g/kg)","Not reported",null,null,null,null,null,"Steady-state PM emission factor"]
["E3 factor (g/kg)","Not reported",null,null,null,null,null,"End PM emission factor"]
["Year-Round Use Weighting"]
["Fi",null,0.437,0.23799999999999999,0.27500000000000002,0.05,null,"Year round use weighting factors"]
["ηdelxFi (%)",null,30.59,19.37,22.36,4.1900000000000004,null,"Weighted delivered efficiency HHV basis"]
["Eg/MJxFi (g/MJ)",null,3.5000000000000001E-3,2.3999999999999998E-3,2.5000000000000001E-3,5.9999999999999995E-4,null,"Weighted emission rate"]
["Eg/kgxFi (g/kg)",null,4.7600000000000003E-2,3.78E-2,4.2099999999999999E-2,9.7000000000000003E-3,null,"Weighted emission rate"]
["Elb/mmBtuxFi (lb/MMBtu)",null,7.9000000000000008E-3,5.4999999999999997E-3,6.1000000000000004E-3,1.4E-3,null,"Weighted emission rate"]
["Eg/hrxFi (g/h)",null,5.33E-2,5.8299999999999998E-2,0.14249999999999999,6.5299999999999997E-2,null,"Weighted emission factor in gram per hour"]
["COg/minxFi",null,1.49E-2,3.3E-3,1.9E-3,5.0000000000000001E-3,null,"CO weighted emission factor in gram per minute"]
["Other Measurements"]
["Tiavg (F)",null,145,149,142,145,null,"Avg. temp. of the appliance and water at start of the test"]
["TFavg (F)",null,149,145,144,144,null,"Avg. tem. of the appliance and water at the end of the test"]
["T6 (F)",null,133,127,124,126,null,"Temp. of the hot water supply as it enters the appliance"]
["T5 (F)",null,165,163,163,163,null,"Temp. of the hot water supply as it leaves the appliance"]
["T3 (F)",null,111,108,113,112,null,"Water temp. at the heath exchanger inlet - load side"]
["T4 (F)",null,123,135,154,151,null,"Water temp. at the heath exchanger outlet - load side"]
["WRemainingFuel",null,null,null,null,null,null,"Weight of unburned fuel at the end of a test"]
["Vf (gal/min)",null,2.3199999999999998,1.84,2.56,5.57,null,"Load side volumetric liquid flow rate"]
["VfS","Not reported",null,null,null,null,null,"Supply side volumetric liquid flow rate"]
["ηdelLHV (%)",null,75.3,87.7,87.5,90.1,null,"Delivered efficiency LHV basis"]
["QinLHV (%)","Not reported",null,null,null,null,null,"Heat input (LHV)"]
["All run data"]
["Low Burn Rate Tested","Not reported"]
["Appliance Fueling","Determination",null,null,null,null,null,"Notes"]
["Pellet species/type","Not reported"]
["Pellet fuel certification","EN plus pellet and A1"]
["Source of the pellet specification","Default values for oak"]
["Owners Manual Req.","Determination",null,null,null,null,null,"Notes"]
["Stack height","Included"]
["Location recommendation","Included"]
["Guidance on proper draft","Included"]
["Fuel loading & reloading","Included"]
["Fuel selection recomm.","Included"]
["Improper fuels warnings","Included"]
["Fire starting procedures","Included"]
["Proper use of air controls","Included"]
["Proper operation low","Included"]
["Ash removal procedures","Included"]
["Replacement parts","Not included"]
["Federal warning (C or NC)","Included"]
["Warranty rights","Not included"]
["Reporting","Determination",null,null,null,null,null,"Notes"]
["Test report complete","Partially reported"]
["Owner manual complete","Partially reported"]
["Lab receipt dates","2019-11-21"]
["Aging dates","Not reported"]
["Test dates","January 13-16, 2020"]
["30 Day notice submitted to EPA","Cannot be determined"]
["Tested on the proposed date","Cannot be determined"]
["Tested in consecutive days","No"]
["60 Day report to EPA","Cannot be determined"]
["Website","Determination",null,null,null,null,null,"Notes"]
["Website address:","https://www.maineenergysystems.com/autopellet-boiler-specifications/"]
["PM emissions (g/h)","Not reported"]
["HHV efficiency (%)","NR",null,"Rated heat output (Btu/hr)",null,null,109500]
["OECA Referall?"]

{"sheet":"MESYS - Pellematic 56","index":5,"n_rows":135,"n_cols":8,"rows_kept":135,"cut":false,"hidden":false,"merged":[[0,0,0,8],[1,1,1,6],[1,7,1,8],[2,1,2,3],[2,5,2,6],[2,7,2,8],[7,1,7,6],[6,1,6,6],[8,1,8,6],[8,7,8,8],[3,1,3,2],[3,3,3,5],[3,7,3,8],[4,1,4,6],[4,7,4,8],[5,1,5,6],[5,7,5,8],[7,7,7,8],[11,1,11,2],[11,3,11,4],[11,5,11,6],[11,7,11,8],[12,1,12,6],[12,7,12,8],[9,1,9,6],[9,7,9,8],[10,1,10,2],[10,3,10,4],[10,5,10,6],[10,7,10,8],[16,1,16,6],[16,7,16,8],[17,1,17,6],[17,7,17,8],[18,1,18,2],[18,3,18,5],[18,7,18,8],[13,1,13,6],[13,7,13,8],[14,1,14,6],[14,7,14,8],[15,1,15,6],[15,7,15,8],[21,1,21,6],[21,7,21,8],[22,1,22,6],[22,7,22,8],[19,1,19,2],[19,3,19,5],[19,7,19,8],[20,1,20,2],[20,3,20,5],[20,7,20,8],[27,1,27,6],[27,7,27,8],[28,1,28,6],[28,7,28,8],[29,1,29,6],[29,7,29,8],[23,1,23,6],[23,7,23,8],[25,1,25,6],[25,7,25,8],[26,1,26,6],[26,7,26,8],[24,1,24,6],[24,7,24,8],[33,1,33,6],[33,7,33,8],[34,1,34,6],[34,7,34,8],[35,1,35,6],[35,7,35,8],[30,1,30,6],[30,7,30,8],[31,1,31,6],[31,7,31,8],[32,1,32,6],[32,7,32,8],[39,1,39,6],[39,7,39,8],[40,1,40,6],[40,7,40,8],[41,0,41,8],[42,7,42,8],[36,1,36,6],[36,7,36,8],[37,1,37,6],[37,7,37,8],[38,1,38,6],[38,7,38,8],[49,7,49,8],[50,7,50,8],[51,7,51,8],[52,7,52,8],[53,0,53,8],[54,7,54,8],[43,7,43,8],[44,7,44,8],[45,7,45,8],[46,7,46,8],[47,7,47,8],[48,7,48,8],[62,7,62,8],[63,0,63,8],[64,7,64,8],[65,7,65,8],[66,7,66,8],[67,7,67,8],[55,7,55,8],[56,7,56,8],[57,7,57,8],[58,7,58,8],[60,7,60,8],[61,7,61,8],[59,7,59,8],[74,7,74,8],[75,7,75,8],[76,7,76,8],[77,7,77,8],[78,7,78,8],[79,7,79,8],[68,7,68,8],[69,7,69,8],[70,7,70,8],[71,7,71,8],[72,7,72,8],[73,0,73,8],[86,7,86,8],[87,7,87,8],[88,0,88,8],[89,7,89,8],[90,7,90,8],[91,7,91,8],[80,0,80,8],[81,7,81,8],[82,7,82,8],[83,7,83,8],[84,7,84,8],[85,7,85,8],[100,1,100,6],[100,7,100,8],[102,1,102,6],[102,7,102,8],[103,1,103,6],[103,7,103,8],[92,7,92,8],[93,7,93,8],[94,7,94,8],[95,7,95,8],[98,7,98,8],[99,7,99,8],[101,1,101,6],[101,7,101,8],[107,1,107,6],[107,7,107,8],[108,1,108,6],[108,7,108,8],[109,1,109,6],[109,7,109,8],[104,1,104,6],[104,7,104,8],[105,1,105,6],[105,7,105,8],[106,1,106,6],[106,7,106,8],[113,1,113,6],[113,7,113,8],[114,1,114,6],[114,7,114,8],[115,1,115,6],[115,7,115,8],[110,1,110,6],[110,7,110,8],[111,1,111,6],[111,7,111,8],[112,1,112,6],[112,7,112,8],[119,1,119,6],[119,7,119,8],[120,1,120,6],[120,7,120,8],[121,1,121,6],[121,7,121,8],[116,1,116,6],[116,7,116,8],[117,1,117,6],[117,7,117,8],[118,1,118,6],[118,7,118,8],[125,1,125,6],[125,7,125,8],[126,1,126,6],[126,7,126,8],[127,1,127,6],[127,7,127,8],[122,1,122,6],[122,7,122,8],[123,1,123,6],[123,7,123,8],[124,1,124,6],[124,7,124,8],[134,1,134,8],[131,1,131,6],[131,7,131,8],[132,1,132,6],[132,7,132,8],[133,1,133,2],[133,3,133,5],[133,7,133,8],[128,1,128,6],[128,7,128,8],[129,1,129,6],[129,7,129,8],[130,1,130,6],[130,7,130,8]]}
["Summary of Review"]
["Manufacturer","Maine Energy Systems"]
["Model","Pellematic 56",null,null,"Type","Boiler"]
["Rated heat output (kw)",56,null,"Rated heat output (Btu/hr)",null,null,191000]
["Water jacket vol. (gal)","Not reported"]
["Original AK List Status","Approved List"]
["Dec. Logic Determination","Move to No Determination List"]
["Current AK List Status","Disapproved ",null,null,null,null,null,"Incorrected Test Method"]
["Submission Docs","Determination",null,null,null,null,null,"Notes"]
["Full test report","Partially reported major"]
["Warranty information","Not reported",null,"Owners manual",null,"Partially reported major"]
["Submission date",null,null,"Review date"]
["Testing Information","Determination",null,null,null,null,null,"Notes"]
["Test method","ASTM 2618",null,null,null,null,null,"did not conduct test according to test method"]
["Test fuel","Pellet",null,null,null,null,null,"used cordwood allowances"]
["Test lab","RISE"]
["Third party certifier","RISE"]
["Test Report Elements","Determination",null,null,null,null,null,"Notes"]
["Overall PM emissions (g/hr)",0.90400000000000003,null,"PM Highest 1-hr (g/hr)",null,null,1.56]
["Overall HHV efficiency (%)",86.3,null,"Max heat output (Btu/hr)",null,null,191000]
["Overall CO (g/hr)",{"$f":"IF(G21=\"\",\"\",IFERROR(G21*60,\"NR\"))","v":1.6199999999999999},null,"Overall CO (g/min)",null,null,2.7E-2]
["Total PM emissions","Less than 18.0 (g)"]
["Manufacturers Instructions to lab","Not reported",null,null,null,null,null,"no appliances settings included in the report. "]
["Efficiency  calculations","Not reported"]
["Overall SLM efficiency (%)","Lower than delivered efficiency (HHV basis)"]
["Burn rate calculations","Not reported"]
["Raw data sheets","Not reported"]
["Pre-burn completed by","Not reported"]
["Pre-burn data","Not reported",null,null,null,null,null,"50 hours of aging"]
["Pre-burn data","Not reported",null,null,null,null,null,"50 hours at medium burn rate"]
["Lab technician notes","Not reported"]
["Doc. of run appropriateness","Not reported"]
["Filter data","Reported"]
["Train precision (%)","Not reported"]
["Negative weights","Not reported"]
["Negs handled appropriately","Not reported"]
["Proportionality","Reported"]
["Doc. of run validity","Not reported"]
["Doc. of run anomolies","Not reported"]
["Doc. of run burn rates","Not reported"]
["Test Run Data","Determination",null,null,null,null,null,"Notes"]
["Data Summary Part A"]
["Run Category",null,"II","II","III","IV"]
["Run date",null,"2020-11-12","2020-12-12","2020-10-12","21/01/2020"]
["Run #",null,1,2,1,2]
["Target Load (Btu/hr)",null,30560,45840,95500,191000]
["Actual Load (Btu/hr)",null,37744,36343,82974,191203]
["Actual Load (% of max)",null,19.8,19,43.4,100.1]
["Total burn time (hr)",null,4,4,4,4]
["Wfuel (lb)",null,22.24,20.95,46.3,108.54,null,"Fuel charge weight, as-fired or \"wet\""]
["MCave (%)",null,6.7,6.7,6.7,6.7,null,"Fuel moisture content - dry basis"]
["Qin (Btu)",null,179282,168848,373231,874955,null,"Total heat input (Btu) - in fuel charge (HHV)"]
["Qout (Btu)",null,150975,145374,331894,764810,null,"Total heat output (Btu)"]
["Data Summary Part B"]
["T2Min (F)",null,124,123,126,127]
["ET (g)",null,3.77,4.21,2.41,4.7300000000000004,null,"Total PM emissions"]
["E (lb/MMBtu)",null,5.5E-2,6.4000000000000001E-2,1.6E-2,1.4E-2,null,"PM Emission rate per unit of heat output"]
["E (g/MJ)",null,2.4E-2,2.7E-2,7.0000000000000001E-3,6.0000000000000001E-3,null,"PM Emission rate per unit of heat output"]
["E (g/hr)",null,0.94599999999999995,1.0569999999999999,0.60899999999999999,1.204,null,"PM Emission rate per hour"]
["E (g/hr) 1st hour",null,0.99,0.99,1.56,1.43,null,"PM Emission rate first hour"]
["E (g/kg)",null,0.4,0.47499999999999998,0.124,0.104,null,"PM Emission factor per kg of fuel"]
["ηdel",null,84.2,86.1,88.9,87.4,null,"Delivered efficiency HHV basis"]
["ηSLM",null,87.7,87.8,86.8,86.4,null,"Efficiency (HHV) based on stack loss method"]
["Data Summary Part C"]
["Startup time (min)","Not reported"]
["Steady-state time (min)","Not reported"]
["End time (min)","Not reported"]
["CO1 (g)","Not reported",null,null,null,null,null,"Startup CO emission"]
["CO2 (g)","Not reported",null,null,null,null,null,"Steady-state CO emission"]
["CO3 (g)","Not reported",null,null,null,null,null,"End CO emission"]
["COT (g)","Not reported",null,null,null,null,null,"Total CO emission"]
["COCH (ppm)","Not reported",null,null,null,null,null,"Average CO, chimney"]
["CODT (ppm)","Not reported",null,null,null,null,null,"Average CO, dilution tunnel"]
["Data Summary Part E"]
["E1 (g)","Not reported",null,null,null,null,null,"Startup PM emission"]
["E2 (g)","Not reported",null,null,null,null,null,"Steady-state PM emission"]
["E3 (g)","Not reported",null,null,null,null,null,"End PM emission"]
["E1 factor (g/kg)","Not reported",null,null,null,null,null,"Startup PM emission factor"]
["E2 factor (g/kg)","Not reported",null,null,null,null,null,"Steady-state PM emission factor"]
["E3 factor (g/kg)","Not reported",null,null,null,null,null,"End PM emission factor"]
["Year-Round Use Weighting"]
["Fi",null,0.33750000000000002,0.33750000000000002,0.27500000000000002,0.05,null,"Year round use weighting factors"]
["ηdelxFi (%)",null,28.42,29.06,24.45,4.37,null,"Weighted delivered efficiency HHV basis"]
["Eg/MJxFi (g/MJ)",null,8.0999999999999996E-3,9.1000000000000004E-3,1.9E-3,2.9999999999999997E-4,null,"Weighted emission rate"]
["Eg/kgxFi (g/kg)",null,0.13500000000000001,0.1603,3.4099999999999998E-2,5.1999999999999998E-3,null,"Weighted emission rate"]
["Elb/mmBtuxFi (lb/MMBtu)",null,1.8599999999999998E-2,2.1600000000000001E-2,4.4000000000000003E-3,6.9999999999999999E-4,null,"Weighted emission rate"]
["Eg/hrxFi (g/h)",null,0.31929999999999997,0.35670000000000002,0.16750000000000001,6.0199999999999997E-2,null,"Weighted emission factor in gram per hour"]
["COg/minxFi",null,6.4000000000000003E-3,6.4000000000000003E-3,9.1000000000000004E-3,5.3E-3,null,"CO weighted emission factor in gram per minute"]
["Other Measurements"]
["Tiavg (F)",null,149,153,148,148,null,"Avg. temp. of the appliance and water at start of the test"]
["TFavg (F)",null,147,143,141,147,null,"Avg. tem. of the appliance and water at the end of the test"]
["T6 (F)",null,129,127,127,129,null,"Temp. of the hot water supply as it enters the appliance"]
["T5 (F)",null,165,162,162,165,null,"Temp. of the hot water supply as it leaves the appliance"]
["T3 (F)",null,111,111,109,110,null,"Water temp. at the heath exchanger inlet - load side"]
["T4 (F)",null,146,146,141,148,null,"Water temp. at the heath exchanger outlet - load side"]
["WRemainingFuel",null,null,null,null,null,null,"Weight of unburned fuel at the end of a test"]
["Vf (gal/min)",null,2.2200000000000002,2.21,5.39,10.02,null,"Load side volumetric liquid flow rate"]
["VfS","Not reported",null,null,null,null,null,"Supply side volumetric liquid flow rate"]
["ηdelLHV (%)",null,90.7,92.7,95.7,94.1,null,"Delivered efficiency LHV basis"]
["QinLHV (%)","Not reported",null,null,null,null,null,"Heat input (LHV)"]
["All run data"]
["Low Burn Rate Tested","Not reported"]
["Appliance Fueling","Determination",null,null,null,null,null,"Notes"]
["Pellet species/type","Not reported"]
["Pellet fuel certification","EN plus pellet and A1"]
["Source of the pellet specification","Default values for oak"]
["Owners Manual Req.","Determination",null,null,null,null,null,"Notes"]
["Stack height","Included"]
["Location recommendation","Included"]
["Guidance on proper draft","Included"]
["Fuel loading & reloading","Included"]
["Fuel selection recomm.","Included"]
["Improper fuels warnings","Included"]
["Fire starting procedures","Included"]
["Proper use of air controls","Included"]
["Proper operation low","Included"]
["Ash removal procedures","Included"]
["Replacement parts","Not included"]
["Federal warning (C or NC)","Included"]
["Warranty rights","Not included"]
["Reporting","Determination",null,null,null,null,null,"Notes"]
["Test report complete","Partially reported"]
["Owner manual complete","Partially reported"]
["Lab receipt dates","2019-11-21"]
["Aging dates","Not reported"]
["Test dates","Dec 9-12th, 2019 and  Jan 21th, 2020"]
["30 Day notice submitted to EPA","Cannot be determined"]
["Tested on the proposed date","Cannot be determined"]
["Tested in consecutive days","No"]
["60 Day report to EPA","Cannot be determined"]
["Website","Determination",null,null,null,null,null,"Notes"]
["Website address:","https://www.froeling.com/fileadmin/content/produkte/Prospekte_Flyer/US_CA/US_Prospekt_PE1Pellet.pdf"]
["PM emissions (g/h)","Not reported"]
["HHV efficiency (%)","NR",null,"Rated heat output (Btu/hr)",null,null,191000]
["OECA Referall?"]

{"sheet":"Froling - PE 1 Pellet 20","index":6,"n_rows":135,"n_cols":8,"rows_kept":135,"cut":false,"hidden":false,"merged":[[0,0,0,8],[1,1,1,6],[1,7,1,8],[2,1,2,3],[2,5,2,6],[2,7,2,8],[8,1,8,6],[8,7,8,8],[3,1,3,2],[3,3,3,5],[3,7,3,8],[4,1,4,6],[4,7,4,8],[5,1,5,6],[5,7,5,8],[6,1,6,6],[7,1,7,6],[7,7,7,8],[11,1,11,2],[11,3,11,4],[11,5,11,6],[11,7,11,8],[12,1,12,6],[12,7,12,8],[9,1,9,6],[9,7,9,8],[10,1,10,2],[10,3,10,4],[10,5,10,6],[10,7,10,8],[16,1,16,6],[16,7,16,8],[17,1,17,6],[17,7,17,8],[18,1,18,2],[18,3,18,5],[18,7,18,8],[13,1,13,6],[13,7,13,8],[14,1,14,6],[14,7,14,8],[15,1,15,6],[15,7,15,8],[21,1,21,6],[21,7,21,8],[22,1,22,6],[22,7,22,8],[19,1,19,2],[19,3,19,5],[19,7,19,8],[20,1,20,2],[20,3,20,5],[20,7,20,8],[27,1,27,6],[27,7,27,8],[28,1,28,6],[28,7,28,8],[29,1,29,6],[29,7,29,8],[23,1,23,6],[23,7,23,8],[25,1,25,6],[25,7,25,8],[26,1,26,6],[26,7,26,8],[24,1,24,6],[24,7,24,8],[33,1,33,6],[33,7,33,8],[34,1,34,6],[34,7,34,8],[35,1,35,6],[35,7,35,8],[30,1,30,6],[30,7,30,8],[31,1,31,6],[31,7,31,8],[32,1,32,6],[32,7,32,8],[39,1,39,6],[39,7,39,8],[40,1,40,6],[40,7,40,8],[41,0,41,8],[42,7,42,8],[36,1,36,6],[36,7,36,8],[37,1,37,6],[37,7,37,8],[38,1,38,6],[38,7,38,8],[49,7,49,8],[50,7,50,8],[51,7,51,8],[52,7,52,8],[53,0,53,8],[54,7,54,8],[43,7,43,8],[44,7,44,8],[45,7,45,8],[46,7,46,8],[47,7,47,8],[48,7,48,8],[62,7,62,8],[63,0,63,8],[64,7,64,8],[65,7,65,8],[66,7,66,8],[67,7,67,8],[55,7,55,8],[56,7,56,8],[57,7,57,8],[58,7,58,8],[60,7,60,8],[61,7,61,8],[59,7,59,8],[74,7,74,8],[75,7,75,8],[76,7,76,8],[77,7,77,8],[78,7,78,8],[79,7,79,8],[68,7,68,8],[69,7,69,8],[70,7,70,8],[71,7,71,8],[72,7,72,8],[73,0,73,8],[86,7,86,8],[87,7,87,8],[88,0,88,8],[89,7,89,8],[90,7,90,8],[91,7,91,8],[80,0,80,8],[81,7,81,8],[82,7,82,8],[83,7,83,8],[84,7,84,8],[85,7,85,8],[100,1,100,6],[100,7,100,8],[102,1,102,6],[102,7,102,8],[103,1,103,6],[103,7,103,8],[92,7,92,8],[93,7,93,8],[94,7,94,8],[95,7,95,8],[98,7,98,8],[99,7,99,8],[101,1,101,6],[101,7,101,8],[107,1,107,6],[107,7,107,8],[108,1,108,6],[108,7,108,8],[109,1,109,6],[109,7,109,8],[104,1,104,6],[104,7,104,8],[105,1,105,6],[105,7,105,8],[106,1,106,6],[106,7,106,8],[113,1,113,6],[113,7,113,8],[114,1,114,6],[114,7,114,8],[115,1,115,6],[115,7,115,8],[110,1,110,6],[110,7,110,8],[111,1,111,6],[111,7,111,8],[112,1,112,6],[112,7,112,8],[119,1,119,6],[119,7,119,8],[120,1,120,6],[120,7,120,8],[121,1,121,6],[121,7,121,8],[116,1,116,6],[116,7,116,8],[117,1,117,6],[117,7,117,8],[118,1,118,6],[118,7,118,8],[125,1,125,6],[125,7,125,8],[126,1,126,6],[126,7,126,8],[127,1,127,6],[127,7,127,8],[122,1,122,6],[122,7,122,8],[123,1,123,6],[123,7,123,8],[124,1,124,6],[124,7,124,8],[134,1,134,8],[131,1,131,6],[131,7,131,8],[132,1,132,6],[132,7,132,8],[133,1,133,2],[133,3,133,5],[133,7,133,8],[128,1,128,6],[128,7,128,8],[129,1,129,6],[129,7,129,8],[130,1,130,6],[130,7,130,8]]}
["Summary of Review"]
["Manufacturer","Froling"]
["Model","PE 1 Pellet 20",null,null,"Type","Boiler"]
["Rated heat output (kw)",20,null,"Rated heat output (Btu/hr)",null,null,68200]
["Water jacket vol. (gal)","Not reported"]
["Original AK List Status","Approved List"]
["Dec. Logic Determination","Move to No Determination List"]
["Current AK List Status","No determination "]
["Submission Docs","Determination",null,null,null,null,null,"Notes"]
["Full test report","Partially reported major"]
["Warranty information","Not reported",null,"Owners manual",null,"Not reported"]
["Submission date",null,null,"Review date"]
["Testing Information","Determination",null,null,null,null,null,"Notes"]
["Test method","ASTM 2618"]
["Test fuel","Pellet"]
["Test lab","RISE"]
["Third party certifier","RISE"]
["Test Report Elements","Determination",null,null,null,null,null,"Notes"]
["Overall PM emissions (g/hr)",0.42499999999999999,null,"PM Highest 1-hr (g/hr)",null,null,1.92]
["Overall HHV efficiency (%)",78.400000000000006,null,"Max heat output (Btu/hr)",null,null,68200]
["Overall CO (g/hr)",{"$f":"IF(G21=\"\",\"\",IFERROR(G21*60,\"NR\"))","v":4.38},null,"Overall CO (g/min)",null,null,7.2999999999999995E-2]
["Total PM emissions","Less than 18.0 (g)"]
["Manufacturers Instructions to lab","Not reported",null,null,null,null,null,"no appliances settings included in the report. "]
["Efficiency  calculations","Reported"]
["Overall SLM efficiency (%)","Higher than delivered efficiency (HHV basis)"]
["Burn rate calculations","Partially reported"]
["Raw data sheets","Reported"]
["Pre-burn completed by","Manufacturer"]
["Pre-burn data","Not reported",null,null,null,null,null,"50 hours of aging"]
["Pre-burn data","Not reported",null,null,null,null,null,"50 hours at medium burn rate"]
["Lab technician notes","Reported"]
["Doc. of run appropriateness","Not reported"]
["Filter data","Reported"]
["Train precision (%)","Not reported"]
["Negative weights","Reported"]
["Negs handled appropriately","Reported"]
["Proportionality","Not reported"]
["Doc. of run validity","Not reported"]
["Doc. of run anomolies","Not reported"]
["Doc. of run burn rates","Not reported"]
["Test Run Data","Determination",null,null,null,null,null,"Notes"]
["Data Summary Part A"]
["Run Category",null,"I","II","III","IV"]
["Run date",null,"21/9/17","2017-12-09","20/9/17","2017-11-09"]
["Run #",null,4,2,3,1]
["Target Load (Btu/hr)",null,"<10,236",16378,34122,68243]
["Actual Load (Btu/hr)",null,9656,14337,29632,67744]
["Actual Load (% of max)",null,14.1,21,43.4,99.3]
["Total burn time (hr)",null,4.2,4,4,4]
["Wfuel (lb)",null,6.61,9.2200000000000006,18.079999999999998,41.36,null,"Fuel charge weight, as-fired or \"wet\""]
["MCave (%)",null,7.5,7.5,7.5,7.5,null,"Fuel moisture content - dry basis"]
["Qin (Btu)",null,52910,73785,144622,330866,null,"Total heat input (Btu) - in fuel charge (HHV)"]
["Qout (Btu)",null,10058,57350,118526,270976,null,"Total heat output (Btu)"]
["Data Summary Part B"]
["T2Min (F)",null,136,138,137,137]
["ET (g)",null,1.17,0.45,2.66,7.38,null,"Total PM emissions"]
["E (lb/MMBtu)",null,6.4000000000000001E-2,1.7000000000000001E-2,0.05,0.06,null,"PM Emission rate per unit of heat output"]
["E (g/MJ)",null,2.8000000000000001E-2,7.0000000000000001E-3,2.1000000000000001E-2,2.5999999999999999E-2,null,"PM Emission rate per unit of heat output"]
["E (g/hr)",null,0.28199999999999997,0.112,0.66600000000000004,1.8440000000000001,null,"PM Emission rate per hour"]
["E (g/hr) 1st hour",null,0.17,0.21,0.49,1.9199999999999998E-2,null,"PM Emission rate first hour"]
["E (g/kg)",null,0.42099999999999999,0.115,0.34899999999999998,0.42299999999999999,null,"PM Emission factor per kg of fuel"]
["ηdel",null,76,77.7,82,81.900000000000006,null,"Delivered efficiency HHV basis"]
["ηSLM",null,86.8,85.9,86,86,null,"Efficiency (HHV) based on stack loss method"]
["Data Summary Part C"]
["Startup time (min)","Not reported"]
["Steady-state time (min)","Not reported"]
["End time (min)","Not reported"]
["CO1 (g)","Not reported",null,null,null,null,null,"Startup CO emission"]
["CO2 (g)","Not reported",null,null,null,null,null,"Steady-state CO emission"]
["CO3 (g)","Not reported",null,null,null,null,null,"End CO emission"]
["COT (g)","Not reported",null,null,null,null,null,"Total CO emission"]
["COCH (ppm)","Not reported",null,null,null,null,null,"Average CO, chimney"]
["CODT (ppm)","Not reported",null,null,null,null,null,"Average CO, dilution tunnel"]
["Data Summary Part E"]
["E1 (g)","Not reported",null,null,null,null,null,"Startup PM emission"]
["E2 (g)","Not reported",null,null,null,null,null,"Steady-state PM emission"]
["E3 (g)","Not reported",null,null,null,null,null,"End PM emission"]
["E1 factor (g/kg)","Not reported",null,null,null,null,null,"Startup PM emission factor"]
["E2 factor (g/kg)","Not reported",null,null,null,null,null,"Steady-state PM emission factor"]
["E3 factor (g/kg)","Not reported",null,null,null,null,null,"End PM emission factor"]
["Year-Round Use Weighting"]
["Fi",null,0.437,0.23799999999999999,0.27500000000000002,0.05,null,"Year round use weighting factors"]
["ηdelxFi (%)",null,33.21,18.489999999999998,22.55,4.0999999999999996,null,"Weighted delivered efficiency HHV basis"]
["Eg/MJxFi (g/MJ)",null,1.2E-2,2E-3,6.0000000000000001E-3,1E-3,null,"Weighted emission rate"]
["Eg/kgxFi (g/kg)",null,0.184,2.7E-2,9.6000000000000002E-2,2.1000000000000001E-2,null,"Weighted emission rate"]
["Elb/mmBtuxFi (lb/MMBtu)",null,2.8000000000000001E-2,4.0000000000000001E-3,1.4E-2,3.0000000000000001E-3,null,"Weighted emission rate"]
["Eg/hrxFi (g/h)",null,0.123,2.7E-2,0.183,9.1999999999999998E-2,null,"Weighted emission factor in gram per hour"]
["COg/minxFi",null,0.03,2.1999999999999999E-2,1.4999999999999999E-2,6.0000000000000001E-3,null,"CO weighted emission factor in gram per minute"]
["Other Measurements"]
["Tiavg (F)",null,144,147,154,156,null,"Avg. temp. of the appliance and water at start of the test"]
["TFavg (F)",null,145,149,154,154,null,"Avg. tem. of the appliance and water at the end of the test"]
["T6 (F)",null,136,138,136,138,null,"Temp. of the hot water supply as it enters the appliance"]
["T5 (F)",null,153,156,172,172,null,"Temp. of the hot water supply as it leaves the appliance"]
["T3 (F)",null,135,136,131,127,null,"Water temp. at the heath exchanger inlet - load side"]
["T4 (F)",null,149,153,163,163,null,"Water temp. at the heath exchanger outlet - load side"]
["WRemainingFuel",null,null,null,null,null,null,"Weight of unburned fuel at the end of a test"]
["Vf (gal/min)",null,1.33,1.79,1.89,3.88,null,"Load side volumetric liquid flow rate"]
["VfS","Not reported",null,null,null,null,null,"Supply side volumetric liquid flow rate"]
["ηdelLHV (%)",null,81.900000000000006,83.7,88.2,88.2,null,"Delivered efficiency LHV basis"]
["QinLHV (%)","Not reported",null,null,null,null,null,"Heat input (LHV)"]
["All run data"]
["Low Burn Rate Tested","Not reported"]
["Appliance Fueling","Determination",null,null,null,null,null,"Notes"]
["Pellet species/type","Not reported"]
["Pellet fuel certification","EN plus pellet and A1"]
["Source of the pellet specification","Lab analysis"]
["Owners Manual Req.","Determination",null,null,null,null,null,"Notes"]
["Stack height","Not included"]
["Location recommendation","Not included"]
["Guidance on proper draft","Not included"]
["Fuel loading & reloading","Not included"]
["Fuel selection recomm.","Not included"]
["Improper fuels warnings","Not included"]
["Fire starting procedures","Not included"]
["Proper use of air controls","Not included"]
["Proper operation low","Not included"]
["Ash removal procedures","Not included"]
["Replacement parts","Not included"]
["Federal warning (C or NC)","Not included"]
["Warranty rights","Not included"]
["Reporting","Determination",null,null,null,null,null,"Notes"]
["Test report complete","Partially reported"]
["Owner manual complete","Not reported"]
["Lab receipt dates","2017-09-05"]
["Aging dates","Not reported"]
["Test dates","Sep 11-21, 2017"]
["30 Day notice submitted to EPA","Cannot be determined"]
["Tested on the proposed date","Cannot be determined"]
["Tested in consecutive days","No"]
["60 Day report to EPA","Cannot be determined"]
["Website","Determination",null,null,null,null,null,"Notes"]
["Website address:","https://www.froeling.com/fileadmin/content/produkte/Prospekte_Flyer/US_CA/US_Prospekt_PE1Pellet.pdf"]
["PM emissions (g/h)",0.42499999999999999]
["HHV efficiency (%)",78.400000000000006,null,"Rated heat output (Btu/hr)",null,null,68200]
["OECA Referall?"]

{"sheet":"Froling - PE 1 Pellet 35","index":7,"n_rows":135,"n_cols":8,"rows_kept":135,"cut":false,"hidden":false,"merged":[[0,0,0,8],[1,1,1,6],[1,7,1,8],[2,1,2,3],[2,5,2,6],[2,7,2,8],[8,1,8,6],[8,7,8,8],[3,1,3,2],[3,3,3,5],[3,7,3,8],[4,1,4,6],[4,7,4,8],[5,1,5,6],[5,7,5,8],[6,1,6,6],[7,1,7,6],[11,1,11,2],[11,3,11,4],[11,5,11,6],[11,7,11,8],[12,1,12,6],[12,7,12,8],[9,1,9,6],[9,7,9,8],[10,1,10,2],[10,3,10,4],[10,5,10,6],[10,7,10,8],[16,1,16,6],[16,7,16,8],[17,1,17,6],[17,7,17,8],[18,1,18,2],[18,3,18,5],[18,7,18,8],[13,1,13,6],[13,7,13,8],[14,1,14,6],[14,7,14,8],[15,1,15,6],[15,7,15,8],[21,1,21,6],[21,7,21,8],[22,1,22,6],[22,7,22,8],[19,1,19,2],[19,3,19,5],[19,7,19,8],[20,1,20,2],[20,3,20,5],[20,7,20,8],[27,1,27,6],[27,7,27,8],[28,1,28,6],[28,7,28,8],[29,1,29,6],[29,7,29,8],[23,1,23,6],[23,7,23,8],[25,1,25,6],[25,7,25,8],[26,1,26,6],[26,7,26,8],[24,1,24,6],[24,7,24,8],[33,1,33,6],[33,7,33,8],[34,1,34,6],[34,7,34,8],[35,1,35,6],[35,7,35,8],[30,1,30,6],[30,7,30,8],[31,1,31,6],[31,7,31,8],[32,1,32,6],[32,7,32,8],[39,1,39,6],[39,7,39,8],[40,1,40,6],[40,7,40,8],[41,0,41,8],[42,7,42,8],[36,1,36,6],[36,7,36,8],[37,1,37,6],[37,7,37,8],[38,1,38,6],[38,7,38,8],[49,7,49,8],[50,7,50,8],[51,7,51,8],[52,7,52,8],[53,0,53,8],[54,7,54,8],[43,7,43,8],[44,7,44,8],[45,7,45,8],[46,7,46,8],[47,7,47,8],[48,7,48,8],[62,7,62,8],[63,0,63,8],[64,7,64,8],[65,7,65,8],[66,7,66,8],[67,7,67,8],[55,7,55,8],[56,7,56,8],[57,7,57,8],[58,7,58,8],[60,7,60,8],[61,7,61,8],[59,7,59,8],[74,7,74,8],[75,7,75,8],[76,7,76,8],[77,7,77,8],[78,7,78,8],[79,7,79,8],[68,7,68,8],[69,7,69,8],[70,7,70,8],[71,7,71,8],[72,7,72,8],[73,0,73,8],[86,7,86,8],[87,7,87,8],[88,0,88,8],[89,7,89,8],[90,7,90,8],[91,7,91,8],[80,0,80,8],[81,7,81,8],[82,7,82,8],[83,7,83,8],[84,7,84,8],[85,7,85,8],[100,1,100,6],[100,7,100,8],[102,1,102,6],[102,7,102,8],[103,1,103,6],[103,7,103,8],[92,7,92,8],[93,7,93,8],[94,7,94,8],[95,7,95,8],[98,7,98,8],[99,7,99,8],[101,1,101,6],[101,7,101,8],[107,1,107,6],[107,7,107,8],[108,1,108,6],[108,7,108,8],[109,1,109,6],[109,7,109,8],[104,1,104,6],[104,7,104,8],[105,1,105,6],[105,7,105,8],[106,1,106,6],[106,7,106,8],[113,1,113,6],[113,7,113,8],[114,1,114,6],[114,7,114,8],[115,1,115,6],[115,7,115,8],[110,1,110,6],[110,7,110,8],[111,1,111,6],[111,7,111,8],[112,1,112,6],[112,7,112,8],[119,1,119,6],[119,7,119,8],[120,1,120,6],[120,7,120,8],[121,1,121,6],[121,7,121,8],[116,1,116,6],[116,7,116,8],[117,1,117,6],[117,7,117,8],[118,1,118,6],[118,7,118,8],[125,1,125,6],[125,7,125,8],[126,1,126,6],[126,7,126,8],[127,1,127,6],[127,7,127,8],[122,1,122,6],[122,7,122,8],[123,1,123,6],[123,7,123,8],[124,1,124,6],[124,7,124,8],[134,1,134,8],[131,1,131,6],[131,7,131,8],[132,1,132,6],[132,7,132,8],[133,1,133,2],[133,3,133,5],[133,7,133,8],[128,1,128,6],[128,7,128,8],[129,1,129,6],[129,7,129,8],[130,1,130,6],[130,7,130,8]]}
["Summary of Review"]
["Manufacturer","Froling"]
["Model","PE 1 Pellet 35",null,null,"Type","Boiler"]
["Rated heat output (kw)",35,null,"Rated heat output (Btu/hr)",null,null,119500]
["Water jacket vol. (gal)","Not reported"]
["Original AK List Status","Approved List"]
["Dec. Logic Determination","Move to No Determination List"]
["Current AK List Status","No determination "]
["Submission Docs","Determination",null,null,null,null,null,"Notes"]
["Full test report","Partially reported major"]
["Warranty information","Not reported",null,"Owners manual",null,"Not reported"]
["Submission date",null,null,"Review date"]
["Testing Information","Determination",null,null,null,null,null,"Notes"]
["Test method","ASTM 2618"]
["Test fuel","Pellet"]
["Test lab","RISE"]
["Third party certifier","RISE"]
["Test Report Elements","Determination",null,null,null,null,null,"Notes"]
["Overall PM emissions (g/hr)",0.67800000000000005,null,"PM Highest 1-hr (g/hr)",null,null,1.28]
["Overall HHV efficiency (%)",80.099999999999994,null,"Max heat output (Btu/hr)",null,null,119500]
["Overall CO (g/hr)",{"$f":"IF(G21=\"\",\"\",IFERROR(G21*60,\"NR\"))","v":4.4399999999999995},null,"Overall CO (g/min)",null,null,7.3999999999999996E-2]
["Total PM emissions","Less than 18.0 (g)"]
["Manufacturers Instructions to lab","Not reported",null,null,null,null,null,"no appliances settings included in the report. "]
["Efficiency  calculations","Reported"]
["Overall SLM efficiency (%)","Lower than delivered efficiency (HHV basis)"]
["Burn rate calculations"]
["Raw data sheets","Reported"]
["Pre-burn completed by","Manufacturer"]
["Pre-burn data","Not reported",null,null,null,null,null,"50 hours of aging"]
["Pre-burn data","Not reported",null,null,null,null,null,"50 hours at medium burn rate"]
["Lab technician notes","Reported"]
["Doc. of run appropriateness","Not reported"]
["Filter data","Reported"]
["Train precision (%)","Not reported"]
["Negative weights","Reported"]
["Negs handled appropriately","Reported"]
["Proportionality","Not reported"]
["Doc. of run validity","Not reported"]
["Doc. of run anomolies","Not reported"]
["Doc. of run burn rates","Not reported"]
["Test Run Data","Determination",null,null,null,null,null,"Notes"]
["Data Summary Part A"]
["Run Category",null,"I","II","III","IV"]
["Run date",null,"14/09/2017","15/09/2017","18/09/2017","13/09/2017"]
["Run #",null,2,3,4,1]
["Target Load (Btu/hr)",null,"<17,914",28662,59713,119425]
["Actual Load (Btu/hr)",null,17255,26194,54796,121300]
["Actual Load (% of max)",null,14,22,46,102]
["Total burn time (hr)",null,4,4,4,4]
["Wfuel (lb)",null,11.27,16.54,32.14,69.86,null,"Fuel charge weight, as-fired or \"wet\""]
["MCave (%)",null,7.5,7.5,7.5,7.5,null,"Fuel moisture content - dry basis"]
["Qin (Btu)",null,90165,132290,257130,558868,null,"Total heat input (Btu) - in fuel charge (HHV)"]
["Qout (Btu)",null,69019,104775,219182,485200,null,"Total heat output (Btu)"]
["Data Summary Part B"]
["T2Min (F)",null,134,135,138,144]
["ET (g)",null,2.62,1.0900000000000001,3.28,8.1999999999999993,null,"Total PM emissions"]
["E (lb/MMBtu)",null,8.4000000000000005E-2,2.3E-2,3.3000000000000002E-2,3.6999999999999998E-2,null,"PM Emission rate per unit of heat output"]
["E (g/MJ)",null,3.5999999999999997E-2,0.01,1.4E-2,1.6E-2,null,"PM Emission rate per unit of heat output"]
["E (g/hr)",null,0.65500000000000003,0.27300000000000002,0.81899999999999995,2.0489999999999999,null,"PM Emission rate per hour"]
["E (g/hr) 1st hour",null,0.47,0.32,0.64,1.2800000000000001E-2,null,"PM Emission rate first hour"]
["E (g/kg)",null,0.55100000000000005,0.156,0.24099999999999999,0.27800000000000002,null,"PM Emission factor per kg of fuel"]
["ηdel",null,76.5,79.2,85.2,86.8,null,"Delivered efficiency HHV basis"]
["ηSLM",null,87.2,87,86.1,84.5,null,"Efficiency (HHV) based on stack loss method"]
["Data Summary Part C"]
["Startup time (min)","Not reported"]
["Steady-state time (min)","Not reported"]
["End time (min)","Not reported"]
["CO1 (g)","Not reported",null,null,null,null,null,"Startup CO emission"]
["CO2 (g)","Not reported",null,null,null,null,null,"Steady-state CO emission"]
["CO3 (g)","Not reported",null,null,null,null,null,"End CO emission"]
["COT (g)","Not reported",null,null,null,null,null,"Total CO emission"]
["COCH (ppm)","Not reported",null,null,null,null,null,"Average CO, chimney"]
["CODT (ppm)","Not reported",null,null,null,null,null,"Average CO, dilution tunnel"]
["Data Summary Part E"]
["E1 (g)","Not reported",null,null,null,null,null,"Startup PM emission"]
["E2 (g)","Not reported",null,null,null,null,null,"Steady-state PM emission"]
["E3 (g)","Not reported",null,null,null,null,null,"End PM emission"]
["E1 factor (g/kg)","Not reported",null,null,null,null,null,"Startup PM emission factor"]
["E2 factor (g/kg)","Not reported",null,null,null,null,null,"Steady-state PM emission factor"]
["E3 factor (g/kg)","Not reported",null,null,null,null,null,"End PM emission factor"]
["Year-Round Use Weighting"]
["Fi",null,0.437,0.23799999999999999,0.27500000000000002,0.05,null,"Year round use weighting factors"]
["ηdelxFi (%)",null,33.43,18.850000000000001,23.43,4.34,null,"Weighted delivered efficiency HHV basis"]
["Eg/MJxFi (g/MJ)",null,1.6E-2,2E-3,4.0000000000000001E-3,1E-3,null,"Weighted emission rate"]
["Eg/kgxFi (g/kg)",null,0.24099999999999999,3.6999999999999998E-2,6.6000000000000003E-2,1.4E-2,null,"Weighted emission rate"]
["Elb/mmBtuxFi (lb/MMBtu)",null,3.6999999999999998E-2,5.0000000000000001E-3,8.9999999999999993E-3,2E-3,null,"Weighted emission rate"]
["Eg/hrxFi (g/h)",null,0.28599999999999998,6.5000000000000002E-2,0.22500000000000001,0.10199999999999999,null,"Weighted emission factor in gram per hour"]
["COg/minxFi",null,2.4E-2,4.0000000000000001E-3,3.1E-2,1.4999999999999999E-2,null,"CO weighted emission factor in gram per minute"]
["Other Measurements"]
["Tiavg (F)",null,145,154,156,162,null,"Avg. temp. of the appliance and water at start of the test"]
["TFavg (F)",null,145,158,156,162,null,"Avg. tem. of the appliance and water at the end of the test"]
["T6 (F)",null,135,136,140,144,null,"Temp. of the hot water supply as it enters the appliance"]
["T5 (F)",null,156,156,172,180,null,"Temp. of the hot water supply as it leaves the appliance"]
["T3 (F)",null,131,131,131,133,null,"Water temp. at the heath exchanger inlet - load side"]
["T4 (F)",null,151,165,163,167,null,"Water temp. at the heath exchanger outlet - load side"]
["WRemainingFuel",null,null,null,null,null,null,"Weight of unburned fuel at the end of a test"]
["Vf (gal/min)",null,1.73,1.57,3.48,7.06,null,"Load side volumetric liquid flow rate"]
["VfS","Not reported",null,null,null,null,null,"Supply side volumetric liquid flow rate"]
["ηdelLHV (%)",null,82.4,85.3,91.8,93.5,null,"Delivered efficiency LHV basis"]
["QinLHV (%)","Not reported",null,null,null,null,null,"Heat input (LHV)"]
["All run data"]
["Low Burn Rate Tested","Not reported"]
["Appliance Fueling","Determination",null,null,null,null,null,"Notes"]
["Pellet species/type","Not reported"]
["Pellet fuel certification","EN plus pellet and A1"]
["Source of the pellet specification","Lab analysis"]
["Owners Manual Req.","Determination",null,null,null,null,null,"Notes"]
["Stack height","Not included"]
["Location recommendation","Not included"]
["Guidance on proper draft","Not included"]
["Fuel loading & reloading","Not included"]
["Fuel selection recomm.","Not included"]
["Improper fuels warnings","Not included"]
["Fire starting procedures","Not included"]
["Proper use of air controls","Not included"]
["Proper operation low","Not included"]
["Ash removal procedures","Not included"]
["Replacement parts","Not included"]
["Federal warning (C or NC)","Not included"]
["Warranty rights","Not included"]
["Reporting","Determination",null,null,null,null,null,"Notes"]
["Test report complete","Partially reported"]
["Owner manual complete","Not reported"]
["Lab receipt dates","2017-09-05"]
["Aging dates","Not reported"]
["Test dates","Sep 11-21, 2017"]
["30 Day notice submitted to EPA","Cannot be determined"]
["Tested on the proposed date","Cannot be determined"]
["Tested in consecutive days","Yes"]
["60 Day report to EPA","Cannot be determined"]
["Website","Determination",null,null,null,null,null,"Notes"]
["Website address:","https://www.froeling.com/fileadmin/content/produkte/Prospekte_Flyer/US_CA/US_Prospekt_PE1Pellet.pdf"]
["PM emissions (g/h)",7.3999999999999996E-2,null,null,null,null,null,"CO emission value is mistakenly written instead of the PM emissions"]
["HHV efficiency (%)",80.099999999999994,null,"Rated heat output (Btu/hr)",null,null,119500]
["OECA Referall?"]

{"sheet":"Hargassner - ECO-HK 70(CH)","index":8,"n_rows":135,"n_cols":8,"rows_kept":135,"cut":false,"hidden":false,"merged":[[0,0,0,8],[1,1,1,6],[1,7,1,8],[2,1,2,3],[2,5,2,6],[2,7,2,8],[8,1,8,6],[8,7,8,8],[3,1,3,2],[3,3,3,5],[3,7,3,8],[4,1,4,6],[4,7,4,8],[5,1,5,6],[5,7,5,8],[6,1,6,6],[7,1,7,6],[11,1,11,2],[11,3,11,4],[11,5,11,6],[11,7,11,8],[12,1,12,6],[12,7,12,8],[9,1,9,6],[9,7,9,8],[10,1,10,2],[10,3,10,4],[10,5,10,6],[10,7,10,8],[16,1,16,6],[16,7,16,8],[17,1,17,6],[17,7,17,8],[18,1,18,2],[18,3,18,5],[18,7,18,8],[13,1,13,6],[13,7,13,8],[14,1,14,6],[14,7,14,8],[15,1,15,6],[15,7,15,8],[21,1,21,6],[21,7,21,8],[22,1,22,6],[22,7,22,8],[19,1,19,2],[19,3,19,5],[19,7,19,8],[20,1,20,2],[20,3,20,5],[20,7,20,8],[27,1,27,6],[27,7,27,8],[28,1,28,6],[28,7,28,8],[29,1,29,6],[29,7,29,8],[23,1,23,6],[23,7,23,8],[25,1,25,6],[25,7,25,8],[26,1,26,6],[26,7,26,8],[24,1,24,6],[24,7,24,8],[33,1,33,6],[33,7,33,8],[34,1,34,6],[34,7,34,8],[35,1,35,6],[35,7,35,8],[30,1,30,6],[30,7,30,8],[31,1,31,6],[31,7,31,8],[32,1,32,6],[32,7,32,8],[39,1,39,6],[39,7,39,8],[40,1,40,6],[40,7,40,8],[41,0,41,8],[42,7,42,8],[36,1,36,6],[36,7,36,8],[37,1,37,6],[37,7,37,8],[38,1,38,6],[38,7,38,8],[49,7,49,8],[50,7,50,8],[51,7,51,8],[52,7,52,8],[53,0,53,8],[54,7,54,8],[43,7,43,8],[44,7,44,8],[45,7,45,8],[46,7,46,8],[47,7,47,8],[48,7,48,8],[62,7,62,8],[63,0,63,8],[64,7,64,8],[65,7,65,8],[66,7,66,8],[67,7,67,8],[55,7,55,8],[56,7,56,8],[57,7,57,8],[58,7,58,8],[60,7,60,8],[61,7,61,8],[59,7,59,8],[74,7,74,8],[75,7,75,8],[76,7,76,8],[77,7,77,8],[78,7,78,8],[79,7,79,8],[68,7,68,8],[69,7,69,8],[70,7,70,8],[71,7,71,8],[72,7,72,8],[73,0,73,8],[86,7,86,8],[87,7,87,8],[88,0,88,8],[89,7,89,8],[90,7,90,8],[91,7,91,8],[80,0,80,8],[81,7,81,8],[82,7,82,8],[83,7,83,8],[84,7,84,8],[85,7,85,8],[100,1,100,6],[100,7,100,8],[102,1,102,6],[102,7,102,8],[103,1,103,6],[103,7,103,8],[92,7,92,8],[93,7,93,8],[94,7,94,8],[95,7,95,8],[98,7,98,8],[99,7,99,8],[101,1,101,6],[101,7,101,8],[107,1,107,6],[107,7,107,8],[108,1,108,6],[108,7,108,8],[109,1,109,6],[109,7,109,8],[104,1,104,6],[104,7,104,8],[105,1,105,6],[105,7,105,8],[106,1,106,6],[106,7,106,8],[113,1,113,6],[113,7,113,8],[114,1,114,6],[114,7,114,8],[115,1,115,6],[115,7,115,8],[110,1,110,6],[110,7,110,8],[111,1,111,6],[111,7,111,8],[112,1,112,6],[112,7,112,8],[119,1,119,6],[119,7,119,8],[120,1,120,6],[120,7,120,8],[121,1,121,6],[121,7,121,8],[116,1,116,6],[116,7,116,8],[117,1,117,6],[117,7,117,8],[118,1,118,6],[118,7,118,8],[125,1,125,6],[125,7,125,8],[126,1,126,6],[126,7,126,8],[127,1,127,6],[127,7,127,8],[122,1,122,6],[122,7,122,8],[123,1,123,6],[123,7,123,8],[124,1,124,6],[124,7,124,8],[134,1,134,8],[131,1,131,6],[131,7,131,8],[132,1,132,6],[132,7,132,8],[133,1,133,2],[133,3,133,5],[133,7,133,8],[128,1,128,6],[128,7,128,8],[129,1,129,6],[129,7,129,8],[130,1,130,6],[130,7,130,8]]}
["Summary of Review"]
["Manufacturer","Hargassner"]
["Model","ECO-HK 70",null,null,"Type","Boiler"]
["Rated heat output (kw)",70,null,"Rated heat output (Btu/hr)",null,null,239000]
["Water jacket vol. (gal)","Not reported"]
["Original AK List Status","Approved List"]
["Dec. Logic Determination","Move to No Determination List"]
["Current AK List Status","No determination "]
["Submission Docs","Determination",null,null,null,null,null,"Notes"]
["Full test report","Partially reported minor"]
["Warranty information","Reported",null,"Owners manual",null,"All reported"]
["Submission date",null,null,"Review date"]
["Testing Information","Determination",null,null,null,null,null,"Notes"]
["Test method","EPA M28 WHH"]
["Test fuel","Chip"]
["Test lab","Polytests Inc."]
["Third party certifier","Not reported"]
["Test Report Elements","Determination",null,null,null,null,null,"Notes"]
["Overall PM emissions (g/hr)",1.546,null,"PM Highest 1-hr (g/hr)",null,null,3.91]
["Overall HHV efficiency (%)",73.599999999999994,null,"Max heat output (Btu/hr)",null,null,239000]
["Overall CO (g/hr)",{"$f":"IF(G21=\"\",\"\",IFERROR(G21*60,\"NR\"))","v":25.259999999999998},null,"Overall CO (g/min)",null,null,0.42099999999999999]
["Total PM emissions","Less than 18.0 (g)"]
["Manufacturers Instructions to lab","Reported"]
["Efficiency  calculations","Reported"]
["Overall SLM efficiency (%)","Higher than delivered efficiency (HHV basis)",null,null,null,null,null,"no appliances settings included in the report. "]
["Burn rate calculations","Reported"]
["Raw data sheets","Reported"]
["Pre-burn completed by","Lab"]
["Pre-burn data","Reported",null,null,null,null,null,"50 hours of aging"]
["Pre-burn data","Reported",null,null,null,null,null,"50 hours at medium burn rate"]
["Lab technician notes","Reported"]
["Doc. of run appropriateness","Not reported"]
["Filter data","Reported"]
["Train precision (%)","Reported"]
["Negative weights","Reported"]
["Negs handled appropriately","Reported"]
["Proportionality","Reported"]
["Doc. of run validity","Reported"]
["Doc. of run anomolies","Reported"]
["Doc. of run burn rates","Partially reported",null,null,null,null,null,"appliance settings used to achieve burn rates not reported."]
["Test Run Data","Determination",null,null,null,null,null,"Notes"]
["Data Summary Part A"]
["Run Category",null,1,2,3,4]
["Run date","Not reported"]
["Run #",null,4,3,2,1]
["Target Load (Btu/hr)",null,30000,47000,109000,239000]
["Actual Load (Btu/hr)",null,31665,46641,107092,247868]
["Actual Load (% of max)",null,13,20,45,103.7]
["Total burn time (hr)",null,4.17,4,4.33,4]
["Wfuel (lb)",null,25.6,34.5,68.16,147,null,"Fuel charge weight, as-fired or \"wet\""]
["MCave (%)",null,9.9,9.9,9.9,9.9,null,"Fuel moisture content - dry basis"]
["Qin (Btu)",null,199932,269439,532318,1148045,null,"Total heat input (Btu) - in fuel charge (HHV)"]
["Qout (Btu)",null,131937,186563,464067,991472,null,"Total heat output (Btu)"]
["Data Summary Part B"]
["T2Min (F)",null,148,160,137,130]
["ET (g)",null,5.7,2,9.4,18.2,null,"Total PM emissions"]
["E (lb/MMBtu)",null,9.6000000000000002E-2,2.4E-2,4.3999999999999997E-2,0.04,null,"PM Emission rate per unit of heat output"]
["E (g/MJ)",null,4.1000000000000002E-2,0.01,1.9E-2,1.7000000000000001E-2,null,"PM Emission rate per unit of heat output"]
["E (g/hr)",null,1.38,0.51,2.16,4.55,null,"PM Emission rate per hour"]
["E (g/hr) 1st hour",null,2.98,0.16,1.56,3.91,null,"PM Emission rate first hour"]
["E (g/kg)",null,0.54,0.14000000000000001,0.33,0.3,null,"PM Emission factor per kg of fuel"]
["ηdel",null,66,69,87,86,null,"Delivered efficiency HHV basis"]
["ηSLM",null,87,89,89,88,null,"Efficiency (HHV) based on stack loss method"]
["Data Summary Part C"]
["Startup time (min)","Not reported"]
["Steady-state time (min)","Not reported"]
["End time (min)","Not reported"]
["CO1 (g)","Not reported",null,null,null,null,null,"Startup CO emission"]
["CO2 (g)","Not reported",null,null,null,null,null,"Steady-state CO emission"]
["CO3 (g)","Not reported",null,null,null,null,null,"End CO emission"]
["COT (g)","Not reported",null,null,null,null,null,"Total CO emission"]
["COCH (ppm)","Not reported",null,null,null,null,null,"Average CO, chimney"]
["CODT (ppm)","Not reported",null,null,null,null,null,"Average CO, dilution tunnel"]
["Data Summary Part E"]
["E1 (g)","Not reported",null,null,null,null,null,"Startup PM emission"]
["E2 (g)","Not reported",null,null,null,null,null,"Steady-state PM emission"]
["E3 (g)","Not reported",null,null,null,null,null,"End PM emission"]
["E1 factor (g/kg)","Not reported",null,null,null,null,null,"Startup PM emission factor"]
["E2 factor (g/kg)","Not reported",null,null,null,null,null,"Steady-state PM emission factor"]
["E3 factor (g/kg)","Not reported",null,null,null,null,null,"End PM emission factor"]
["Year-Round Use Weighting"]
["Fi",null,0.437,0.23799999999999999,0.27500000000000002,5.0000000000000001E-3,null,"Year round use weighting factors"]
["ηdelxFi (%)",null,0.28799999999999998,0.16500000000000001,0.24,4.2999999999999997E-2,null,"Weighted delivered efficiency HHV basis"]
["Eg/MJxFi (g/MJ)",null,1.7999999999999999E-2,2E-3,5.0000000000000001E-3,1E-3,null,"Weighted emission rate"]
["Eg/kgxFi (g/kg)",null,0.23799999999999999,3.4000000000000002E-2,9.1999999999999998E-2,1.4999999999999999E-2,null,"Weighted emission rate"]
["Elb/mmBtuxFi (lb/MMBtu)",null,4.2000000000000003E-2,6.0000000000000001E-3,1.2E-2,2E-3,null,"Weighted emission rate"]
["Eg/hrxFi (g/h)",null,0.60299999999999998,0.121,0.59399999999999997,0.22700000000000001,null,"Weighted emission factor in gram per hour"]
["COg/minxFi",null,0.60299999999999998,0.121,0.59399999999999997,0.22700000000000001,null,"CO weighted emission factor in gram per minute"]
["Other Measurements"]
["Tiavg (F)","Not reported",null,null,null,null,null,"Avg. temp. of the appliance and water at start of the test"]
["TFavg (F)","Not reported",null,null,null,null,null,"Avg. tem. of the appliance and water at the end of the test"]
["T6 (F)","Not reported",null,null,null,null,null,"Temp. of the hot water supply as it enters the appliance"]
["T5 (F)","Not reported",null,null,null,null,null,"Temp. of the hot water supply as it leaves the appliance"]
["T3 (F)","Not reported",null,null,null,null,null,"Water temp. at the heath exchanger inlet - load side"]
["T4 (F)","Not reported",null,null,null,null,null,"Water temp. at the heath exchanger outlet - load side"]
["WRemainingFuel","Not reported",null,null,null,null,null,"Weight of unburned fuel at the end of a test"]
["Vf (gal/min)","Not reported",null,null,null,null,null,"Load side volumetric liquid flow rate"]
["VfS","Not reported",null,null,null,null,null,"Supply side volumetric liquid flow rate"]
["ηdelLHV (%)","Not reported",null,null,null,null,null,"Delivered efficiency LHV basis"]
["QinLHV (%)","Not reported",null,null,null,null,null,"Heat input (LHV)"]
["All run data"]
["Low Burn Rate Tested","Not reported"]
["Appliance Fueling","Determination",null,null,null,null,null,"Notes"]
["Pellet species/type","Not reported",null,null,null,null,null,"Appendix D is missing"]
["Pellet fuel certification","Not reported",null,null,null,null,null,"Appendix D is missing"]
["Source of the pellet specification","Not reported",null,null,null,null,null,"Appendix D is missing"]
["Owners Manual Req.","Determination",null,null,null,null,null,"Notes"]
["Stack height","Included"]
["Location recommendation","Included"]
["Guidance on proper draft","Included"]
["Fuel loading & reloading","Included"]
["Fuel selection recomm.","Included"]
["Improper fuels warnings","Included"]
["Fire starting procedures","Included"]
["Proper use of air controls","Included"]
["Proper operation low","Included"]
["Ash removal procedures","Included"]
["Replacement parts","Included"]
["Federal warning (C or NC)","Included"]
["Warranty rights","Included"]
["Reporting","Determination",null,null,null,null,null,"Notes"]
["Test report complete","Partially reported"]
["Owner manual complete","All reported"]
["Lab receipt dates","Not reported"]
["Aging dates","Not reported"]
["Test dates","Sep 9-12, 2019"]
["30 Day notice submitted to EPA","Cannot be determined"]
["Tested on the proposed date","Cannot be determined"]
["Tested in consecutive days","Yes"]
["60 Day report to EPA","Yes"]
["Website","Determination",null,null,null,null,null,"Notes"]
["Website address:","https://www.hargassner.at/en/wood-chip/boiler-eco-hk-20-60-kw-2.html"]
["PM emissions (g/h)","Not reported"]
["HHV efficiency (%)","NR",null,"Rated heat output (Btu/hr)",null,null,"NR"]
["OECA Referall?"]

{"sheet":"Hargassner - ECO-HK 70(P)","index":9,"n_rows":135,"n_cols":8,"rows_kept":135,"cut":false,"hidden":false,"merged":[[0,0,0,8],[1,1,1,6],[1,7,1,8],[2,1,2,3],[2,5,2,6],[2,7,2,8],[8,1,8,6],[8,7,8,8],[3,1,3,2],[3,3,3,5],[3,7,3,8],[4,1,4,6],[4,7,4,8],[5,1,5,6],[5,7,5,8],[6,1,6,6],[7,1,7,6],[11,1,11,2],[11,3,11,4],[11,5,11,6],[11,7,11,8],[12,1,12,6],[12,7,12,8],[9,1,9,6],[9,7,9,8],[10,1,10,2],[10,3,10,4],[10,5,10,6],[10,7,10,8],[16,1,16,6],[16,7,16,8],[17,1,17,6],[17,7,17,8],[18,1,18,2],[18,3,18,5],[18,7,18,8],[13,1,13,6],[13,7,13,8],[14,1,14,6],[14,7,14,8],[15,1,15,6],[15,7,15,8],[21,1,21,6],[21,7,21,8],[22,1,22,6],[22,7,22,8],[19,1,19,2],[19,3,19,5],[19,7,19,8],[20,1,20,2],[20,3,20,5],[20,7,20,8],[27,1,27,6],[27,7,27,8],[28,1,28,6],[28,7,28,8],[29,1,29,6],[29,7,29,8],[23,1,23,6],[23,7,23,8],[25,1,25,6],[25,7,25,8],[26,1,26,6],[26,7,26,8],[24,1,24,6],[24,7,24,8],[33,1,33,6],[33,7,33,8],[34,1,34,6],[34,7,34,8],[35,1,35,6],[35,7,35,8],[30,1,30,6],[30,7,30,8],[31,1,31,6],[31,7,31,8],[32,1,32,6],[32,7,32,8],[39,1,39,6],[39,7,39,8],[40,1,40,6],[40,7,40,8],[41,0,41,8],[42,7,42,8],[36,1,36,6],[36,7,36,8],[37,1,37,6],[37,7,37,8],[38,1,38,6],[38,7,38,8],[49,7,49,8],[50,7,50,8],[51,7,51,8],[52,7,52,8],[53,0,53,8],[54,7,54,8],[43,7,43,8],[44,7,44,8],[45,7,45,8],[46,7,46,8],[47,7,47,8],[48,7,48,8],[62,7,62,8],[63,0,63,8],[64,7,64,8],[65,7,65,8],[66,7,66,8],[67,7,67,8],[55,7,55,8],[56,7,56,8],[57,7,57,8],[58,7,58,8],[60,7,60,8],[61,7,61,8],[59,7,59,8],[74,7,74,8],[75,7,75,8],[76,7,76,8],[77,7,77,8],[78,7,78,8],[79,7,79,8],[68,7,68,8],[69,7,69,8],[70,7,70,8],[71,7,71,8],[72,7,72,8],[73,0,73,8],[86,7,86,8],[87,7,87,8],[88,0,88,8],[89,7,89,8],[90,7,90,8],[91,7,91,8],[80,0,80,8],[81,7,81,8],[82,7,82,8],[83,7,83,8],[84,7,84,8],[85,7,85,8],[100,1,100,6],[100,7,100,8],[102,1,102,6],[102,7,102,8],[103,1,103,6],[103,7,103,8],[92,7,92,8],[93,7,93,8],[94,7,94,8],[95,7,95,8],[98,7,98,8],[99,7,99,8],[101,1,101,6],[101,7,101,8],[107,1,107,6],[107,7,107,8],[108,1,108,6],[108,7,108,8],[109,1,109,6],[109,7,109,8],[104,1,104,6],[104,7,104,8],[105,1,105,6],[105,7,105,8],[106,1,106,6],[106,7,106,8],[113,1,113,6],[113,7,113,8],[114,1,114,6],[114,7,114,8],[115,1,115,6],[115,7,115,8],[110,1,110,6],[110,7,110,8],[111,1,111,6],[111,7,111,8],[112,1,112,6],[112,7,112,8],[119,1,119,6],[119,7,119,8],[120,1,120,6],[120,7,120,8],[121,1,121,6],[121,7,121,8],[116,1,116,6],[116,7,116,8],[117,1,117,6],[117,7,117,8],[118,1,118,6],[118,7,118,8],[125,1,125,6],[125,7,125,8],[126,1,126,6],[126,7,126,8],[127,1,127,6],[127,7,127,8],[122,1,122,6],[122,7,122,8],[123,1,123,6],[123,7,123,8],[124,1,124,6],[124,7,124,8],[134,1,134,8],[131,1,131,6],[131,7,131,8],[132,1,132,6],[132,7,132,8],[133,1,133,2],[133,3,133,5],[133,7,133,8],[128,1,128,6],[128,7,128,8],[129,1,129,6],[129,7,129,8],[130,1,130,6],[130,7,130,8]]}
["Summary of Review"]
["Manufacturer","Hargassner"]
["Model","ECO-HK 70",null,null,"Type","Boiler"]
["Rated heat output (kw)",70,null,"Rated heat output (Btu/hr)",null,null,239000]
["Water jacket vol. (gal)","Not reported"]
["Original AK List Status","Approved List"]
["Dec. Logic Determination","Move to No Determination List"]
["Current AK List Status","No determination "]
["Submission Docs","Determination",null,null,null,null,null,"Notes"]
["Full test report","Partially reported minor"]
["Warranty information","Reported",null,"Owners manual",null,"All reported"]
["Submission date",null,null,"Review date"]
["Testing Information","Determination",null,null,null,null,null,"Notes"]
["Test method","EPA M28 WHH"]
["Test fuel","Pellet"]
["Test lab","Polytests Inc."]
["Third party certifier","Not reported"]
["Test Report Elements","Determination",null,null,null,null,null,"Notes"]
["Overall PM emissions (g/hr)",1.6950000000000001,null,"PM Highest 1-hr (g/hr)",null,null,2.4900000000000002]
["Overall HHV efficiency (%)",86.6,null,"Max heat output (Btu/hr)",null,null,239000]
["Overall CO (g/hr)",{"$f":"IF(G21=\"\",\"\",IFERROR(G21*60,\"NR\"))","v":5.3999999999999995},null,"Overall CO (g/min)",null,null,0.09]
["Total PM emissions","Less than 18.0 (g)"]
["Manufacturers Instructions to lab","Reported",null,null,null,null,null,"no appliances settings included in the report. "]
["Efficiency  calculations","Reported"]
["Overall SLM efficiency (%)","Lower than delivered efficiency (HHV basis)"]
["Burn rate calculations","Reported"]
["Raw data sheets","Reported"]
["Pre-burn completed by","Lab"]
["Pre-burn data","Reported",null,null,null,null,null,"50 hours of aging"]
["Pre-burn data","Reported",null,null,null,null,null,"50 hours at medium burn rate"]
["Lab technician notes","Reported"]
["Doc. of run appropriateness","Not reported"]
["Filter data","Reported"]
["Train precision (%)","Reported"]
["Negative weights","Reported"]
["Negs handled appropriately","Reported"]
["Proportionality","Reported"]
["Doc. of run validity","Reported"]
["Doc. of run anomolies","Reported"]
["Doc. of run burn rates","Partially reported",null,null,null,null,null,"appliance settings used to achieve burn rates not reported."]
["Test Run Data","Determination",null,null,null,null,null,"Notes"]
["Data Summary Part A"]
["Run Category",null,1,2,3,4]
["Run date","Not reported"]
["Run #",null,3,4,2,1]
["Target Load (Btu/hr)",null,34000,52000,109000,239000]
["Actual Load (Btu/hr)",null,35228,51929,103894,250794]
["Actual Load (% of max)",null,14.7,21.7,43.5,104.9]
["Total burn time (hr)",null,4,4.08,4.05,4]
["Wfuel (lb)",null,20.27,29.72,56.09,136.27000000000001,null,"Fuel charge weight, as-fired or \"wet\""]
["MCave (%)",null,5.41,5.41,5.41,5.41,null,"Fuel moisture content - dry basis"]
["Qin (Btu)",null,167798,246027,464322,1128064,null,"Total heat input (Btu) - in fuel charge (HHV)"]
["Qout (Btu)",null,140914,212041,420769,1003177,null,"Total heat output (Btu)"]
["Data Summary Part B"]
["T2Min (F)",null,158,162,143,133]
["ET (g)",null,6.1,5.8,8.6999999999999993,7.1,null,"Total PM emissions"]
["E (lb/MMBtu)",null,9.6000000000000002E-2,6.0999999999999999E-2,4.5999999999999999E-2,1.6E-2,null,"PM Emission rate per unit of heat output"]
["E (g/MJ)",null,4.1000000000000002E-2,2.5999999999999999E-2,0.02,7.0000000000000001E-3,null,"PM Emission rate per unit of heat output"]
["E (g/hr)",null,1.54,1.43,2.16,1.78,null,"PM Emission rate per hour"]
["E (g/hr) 1st hour",null,1.26,1.38,2.4900000000000002,1.72,null,"PM Emission rate first hour"]
["E (g/kg)",null,0.7,0.46,0.36,0.12,null,"PM Emission factor per kg of fuel"]
["ηdel",null,84,86,91,89,null,"Delivered efficiency HHV basis"]
["ηSLM",null,90,89,90,89,null,"Efficiency (HHV) based on stack loss method"]
["Data Summary Part C"]
["Startup time (min)","Not reported"]
["Steady-state time (min)","Not reported"]
["End time (min)","Not reported"]
["CO1 (g)","Not reported",null,null,null,null,null,"Startup CO emission"]
["CO2 (g)","Not reported",null,null,null,null,null,"Steady-state CO emission"]
["CO3 (g)","Not reported",null,null,null,null,null,"End CO emission"]
["COT (g)","Not reported",null,null,null,null,null,"Total CO emission"]
["COCH (ppm)","Not reported",null,null,null,null,null,"Average CO, chimney"]
["CODT (ppm)","Not reported",null,null,null,null,null,"Average CO, dilution tunnel"]
["Data Summary Part E"]
["E1 (g)","Not reported",null,null,null,null,null,"Startup PM emission"]
["E2 (g)","Not reported",null,null,null,null,null,"Steady-state PM emission"]
["E3 (g)","Not reported",null,null,null,null,null,"End PM emission"]
["E1 factor (g/kg)","Not reported",null,null,null,null,null,"Startup PM emission factor"]
["E2 factor (g/kg)","Not reported",null,null,null,null,null,"Steady-state PM emission factor"]
["E3 factor (g/kg)","Not reported",null,null,null,null,null,"End PM emission factor"]
["Year-Round Use Weighting"]
["Fi",null,0.437,0.23799999999999999,0.27500000000000002,5.0000000000000001E-3,null,"Year round use weighting factors"]
["ηdelxFi (%)",null,0.36699999999999999,0.20499999999999999,0.249,4.3999999999999997E-2,null,"Weighted delivered efficiency HHV basis"]
["Eg/MJxFi (g/MJ)",null,1.7999999999999999E-2,6.0000000000000001E-3,5.0000000000000001E-3,0,null,"Weighted emission rate"]
["Eg/kgxFi (g/kg)",null,0.308,0.109,0.1,6.0000000000000001E-3,null,"Weighted emission rate"]
["Elb/mmBtuxFi (lb/MMBtu)",null,4.2000000000000003E-2,1.4E-2,1.2999999999999999E-2,1E-3,null,"Weighted emission rate"]
["Eg/hrxFi (g/h)",null,0.67100000000000004,0.34100000000000003,0.59399999999999997,8.8999999999999996E-2,null,"Weighted emission factor in gram per hour"]
["COg/minxFi","Not reported",null,null,null,null,null,"CO weighted emission factor in gram per minute"]
["Other Measurements"]
["Tiavg (F)","Not reported",null,null,null,null,null,"Avg. temp. of the appliance and water at start of the test"]
["TFavg (F)","Not reported",null,null,null,null,null,"Avg. tem. of the appliance and water at the end of the test"]
["T6 (F)","Not reported",null,null,null,null,null,"Temp. of the hot water supply as it enters the appliance"]
["T5 (F)","Not reported",null,null,null,null,null,"Temp. of the hot water supply as it leaves the appliance"]
["T3 (F)","Not reported",null,null,null,null,null,"Water temp. at the heath exchanger inlet - load side"]
["T4 (F)","Not reported",null,null,null,null,null,"Water temp. at the heath exchanger outlet - load side"]
["WRemainingFuel","Not reported",null,null,null,null,null,"Weight of unburned fuel at the end of a test"]
["Vf (gal/min)","Not reported",null,null,null,null,null,"Load side volumetric liquid flow rate"]
["VfS","Not reported",null,null,null,null,null,"Supply side volumetric liquid flow rate"]
["ηdelLHV (%)","Not reported",null,null,null,null,null,"Delivered efficiency LHV basis"]
["QinLHV (%)","Not reported",null,null,null,null,null,"Heat input (LHV)"]
["All run data"]
["Low Burn Rate Tested","Not reported"]
["Appliance Fueling","Determination",null,null,null,null,null,"Notes"]
["Pellet species/type","Not reported",null,null,null,null,null,"Appendix D is missing"]
["Pellet fuel certification","Not reported",null,null,null,null,null,"Appendix D is missing"]
["Source of the pellet specification","Not reported",null,null,null,null,null,"Appendix D is missing"]
["Owners Manual Req.","Determination",null,null,null,null,null,"Notes"]
["Stack height","Included"]
["Location recommendation","Included"]
["Guidance on proper draft","Included"]
["Fuel loading & reloading","Included"]
["Fuel selection recomm.","Included"]
["Improper fuels warnings","Included"]
["Fire starting procedures","Included"]
["Proper use of air controls","Included"]
["Proper operation low","Included"]
["Ash removal procedures","Included"]
["Replacement parts","Included"]
["Federal warning (C or NC)","Included"]
["Warranty rights","Included"]
["Reporting","Determination",null,null,null,null,null,"Notes"]
["Test report complete","Partially reported"]
["Owner manual complete","All reported"]
["Lab receipt dates","Not reported"]
["Aging dates","Not reported"]
["Test dates","Sep 9-12, 2019"]
["30 Day notice submitted to EPA","Cannot be determined"]
["Tested on the proposed date","Cannot be determined"]
["Tested in consecutive days","Yes"]
["60 Day report to EPA","Yes"]
["Website","Determination",null,null,null,null,null,"Notes"]
["Website address:","https://www.hargassner.at/en/wood-chip/boiler-eco-hk-20-60-kw-2.html"]
["PM emissions (g/h)","Not reported"]
["HHV efficiency (%)","NR",null,"Rated heat output (Btu/hr)",null,null,"NR"]
["OECA Referall?"]